{"text_format":"1","workbook":"xlsx","n_sheets":8,"sheets":["임시반편성통합원본","전체명렬","명렬전체","자율(이용안내)","진로","종합의견","교과세특","야자출석부(두칸)"],"not_rendered":{"charts":0,"images":0,"macros":1,"external_links":15,"defined_names":245,"comments":2,"pivot_tables":0},"unopened":[],"bounds":{"document_bytes":16777216,"sheet_cells":100000,"rows_first":2000,"rows_last":500,"rows_between":2000,"halvings":0,"cell_chars":16384,"cell_head_chars":4096},"cells_cut":0,"cells_raw":0,"read":"whole","date_system":"1900"}

{"sheet":"임시반편성통합원본","index":0,"n_rows":537,"n_cols":26,"rows_kept":537,"cut":false,"hidden":true,"merged":[]}
[null,"학반","번호","출신중명","이름","보호자성명","보호자관계","보호자전화","학생전화","생년월일","계열","체육종목","보훈번호","시도","구군","도로명","건물번호","건물명","상세주소","백분율","석차","국어","수학","영어","석차","반펀성석차"]
[{"$f":"B2*100+C2","v":1101},11,1,"대구동중","강나연","강봉석","부","01058934513","01042204513","990820","일반",null,null,"대구광역시","수성구","상록로","69","래미안수성","105동 605호 (범어동)",22.992999999999999,189,76,92,84,144,153]
[{"$f":"B3*100+C3","v":1301},13,1,"소선여중","강나영","이정애","모","01025241123","01076610355","990207","일반",null,null,"대구광역시","수성구","범어로24길","22-1",null,"(범어동)",50.314,367,76,64,64,335,354]
[1201,12,1,"노변중","강민주","제갈원","모","01042884834","01092374838","991022","일반",null,null,"대구광역시","수성구","노변로","55","수성월드메르디앙","105동 105호 (노변동)",4.407,29,72,96,88,120,103]
[301,3,1,"동도중","강연주","강동필","부","01035181012","01074888335","990426","일반",null,null,"대구광역시","수성구","범어로","45","가든하이츠","105동 105호 (범어동)",39.203000000000003,296,76,80,96,144,173]
[901,9,1,"지산중","강연희","여순임","모","01025294668","01051134669","990707","일반",null,null,"대구광역시","수성구","지범로31안길","3-9",null,"(지산동)",75.575000000000003,485,52,24,36,496,499]
[101,1,1,"대구동중","강주영","김명순","모","01094493534","01099123534","991026","일반",null,null,"대구광역시","수성구","명덕로","455","수성3가 롯데캐슬","103동 401호 (수성동3가)",20.254999999999999,162,88,84,88,102,114]
[401,4,1,"노변중","강진하","하정란","모","01093900268","01089900278","991108","일반",null,null,"대구광역시","수성구","달구벌대로","3110","아이프라임시지","102동 1102호 (시지동)",30.847000000000001,246,76,64,88,256,258]
[902,9,2,"대구동중","강태인","최미숙","모","01095359026","01085609026","991129","일반",null,null,"대구광역시","수성구","명덕로","455","수성3가 롯데캐슬","107동 203호 (수성동3가)",62.043999999999997,435,32,68,60,451,460]
[938,9,38,"대구일중","고민지","권미정","모","01041566903","01041816903","990820","체특","배구",null,"경상북도","포항시 남구","양학천로","102-1","그랜맨션","나동 109호 (대도동)",95.11,517,0,0,0,0,0]
[201,2,1,"고산중","고영경","이현숙","모","01075809975","01075879975","000211","일반",null,null,"대구광역시","수성구","달구벌대로641길","8","매호2차동서타운","203동 1102호 (매호동)",56.322000000000003,403,64,68,60,378,393]
[302,3,2,"성지중","공여진","조은숙","모","01085926952","01048426951","000228","일반",null,null,"대구광역시","수성구","범어천로","200","범어월드메르디앙 웨스턴카운티","203동 202호 (범어동)",44.191000000000003,328,64,64,80,316,336]
[1102,11,2,"공산중","곽소영","최문희","모","01093760234","01065861127","990720","일반",null,null,"대구광역시","수성구","범어로26길","26-3",null,"(범어동)",16.456,128,72,36,92,352,321]
[1202,12,2,"황금중","구문정","윤순임","모","01067806583","01028886583","990817","일반",null,null,"대구광역시","수성구","동대구로54길","63",null,"(범어동)",79.301000000000002,497,68,36,88,378,411]
[303,3,3,"매호중","구보민","장재교","모","01023548231","01026088231","990708","일반",null,null,"대구광역시","수성구","천을로23길","21","신매역우방유쉘","101동 405호 (매호동)",32.045000000000002,252,84,80,92,120,145]
[601,6,1,"대구동중","권민서","채희주","모","01067720305","01067120304","990304","일반",null,null,"대구광역시","수성구","동대구로38안길","32",null,"(범어동)",27.19,219,84,72,52,316,305]
[1103,11,3,"동도중","권민성","권영락","부","01045343857","01041553857","990525","일반",null,null,"대구광역시","수성구","달구벌대로","2435","두산위브더제니스","101동 3401호 (범어동)",5.0309999999999997,35,96,92,96,17,18]
[403,4,3,"대구동중","권민주","권홍국","부","01025051424","01068501424","990613","일반",null,null,"대구광역시","수성구","명덕로","455","수성3가 롯데캐슬","106동 902호 (수성동3가)",53.832000000000001,388,72,32,52,460,455]
[202,2,2,"대구동부중","권민주","이혜정","모","01023092997","01067442997","990607","일반",null,null,"대구광역시","수성구","동원로","100","메트로팔레스5단지","502-505 (만촌동)",12.53,92,88,88,96,53,56]
[1302,13,2,"매호중","권세아","박수정","모","01093738687","01059368644","990714","일반",null,null,"대구광역시","수성구","천을로","180","매호동서타운","101동 1101호 (매호동)",78.182000000000002,491,44,40,44,487,495]
{"$rows_left_out":518}
{"sheet":"전체명렬","index":1,"n_rows":48,"n_cols":15,"rows_kept":48,"cut":false,"hidden":true,"merged":[]}
[null,1,2,3,4,5,6,7,8,9,10,11,12,13,14]
["담임","권영륜","서은경","최동길","이현숙","임태영","이수진","김홍찬","박정미","이경","김영애","박청욱","장은지","송민","김현효"]
[1,"강주영","고영경","강연주","강진하","공다현","권민서","권수정","김민정","강연희","금정연","강나연","강민주","강나영","김미경"]
[2,"권태경","권민주","공여진","공다은","권채현","김령","김경민","김소연","강태인","김나경","곽소영","구문정","권세아","김민정"]
[3,"김규리","권혜령","구보민","권민주","길나령","김서현","김수경","김소희","김보승","김서현","권민성","권세현","권시현","김민지"]
[4,"김나경","김기령","김경민","권유경","김고은","김세영","김예원","김수현","김상은","김지현","김규나","권효민","권평강","김보련"]
[5,"김윤주","김민지","김나연","김가민","김나연","김유진","김우주","김시연","김수영","노은채","김미현","김규진","김가은","김성은"]
[6,"김지윤","김석희","김미연","김보현","김도연","김정은","김윤지","김예진","김예지","박민선","김민지","김민지","김고은","김세빈"]
[7,"박경연","김은희","김보민","김수민","김문진","김주연","김지아","김유진","김정임","박성미","김서희","김수민","김규리","김소연"]
[8,"박민영","김효진","김보현","김지원","김수지","김주희","김현진","김윤지","김지인","박유정","김수연","김수현","김나영","김유진"]
[9,"박정빈","류인지","김은혜","김지혜","김수현","김채연","박무진","김혜영","김효주","박정은","김수진","김호정","김다영","김해미"]
[10,"박지현","마채영","김효정","박규리","김시원","김현정","박서현","나영","박규리","박주미","김연수","김효영","김명주","김현지"]
[11,"배하연","박나현","남지은","박수연","김윤지","나유경","박영연","박세영","박도연","박채린","김은지","박수현","김민영","박성지"]
[12,"백승비","박민주","류효림","박정민","김정민","박규리","박예진","박소현","박소윤","박혜진","김정윤","송영서","김소정","서효정"]
[13,"손유진","박소희","박설아","박채린","남연수","박지현","박용희","박예림","방선윤","손수빈","남경희","안지원","김예원","설강이"]
[14,"신정아","박윤아","박하민","배주영","남현지","박진영","배세인","배윤아","배윤주","송수진","노원경","유예지","김지원","송서연"]
[15,"신혜인","박주연","사수빈","송하늘","류수민","서지수","서희정","배은빈","백다현","신은영","박근희","유하영","김현지","송유진"]
[16,"안다인","박지수","성가현","신준희","문채은","양혜수","신해원","배정민","백지은","신지현","박소연","이가은","남연정","신정음"]
[17,"여승윤","박희연","시민정","양민아","박근아","우혜지","양은지","서정은","서명진","심은진","박지윤","이윤서","박세빈","윤소예"]
[18,"오소연","배호정","신세인","양수진","박민주","윤성원","오유진","성지원","서채원","오유진","배다현","이정은","박소미","은지수"]
{"$rows_left_out":29}
{"sheet":"명렬전체","index":2,"n_rows":37,"n_cols":10,"rows_kept":37,"cut":false,"hidden":false,"merged":[]}
[null,1,2,3,4,5,6,7,8,9]
["번호"]
[1]
[2]
[3]
[4]
[5]
[6]
[7]
[8]
[9]
[10]
[11]
[12]
[13]
[14]
[15]
[16]
[17]
[18]
{"$rows_left_out":18}
{"sheet":"자율(이용안내)","index":3,"n_rows":34,"n_cols":8,"rows_kept":34,"cut":false,"hidden":false,"merged":[]}
["번호","이름","자율활동(총 1500 바이트 - 500자) 바이트계산 : 한글 3, 영문숫자 1, 엔터키 2"," ","바이트","총 바이트","반입력",9]
[1,{"$f":"HLOOKUP($H$1,명렬전체!$B$1:$K$32,3,FALSE)","v":0},null,{"$f":"LEN(C2)","v":0},{"$f":"LENB(C2)","v":0},{"$f":"((E2-D2)*3+(D2)*2-(E2))","v":0}]
[{"$f":"A2+1","v":2},{"$f":"HLOOKUP($H$1,명렬전체!$B$1:$K$32,4,FALSE)","v":0},null,{"$f":"LEN(C3)","v":0},{"$f":"LENB(C3)","v":0},{"$f":"((E3-D3)*3+(D3)*2-(E3))","v":0}]
[3,{"$f":"HLOOKUP($H$1,명렬전체!$B$1:$K$32,5,FALSE)","v":0},null,0,0,0]
[4,{"$f":"HLOOKUP($H$1,명렬전체!$B$1:$K$32,6,FALSE)","v":0},null,0,0,0]
[5,{"$f":"HLOOKUP($H$1,명렬전체!$B$1:$K$32,7,FALSE)","v":0},null,0,0,0]
[6,{"$f":"HLOOKUP($H$1,명렬전체!$B$1:$K$32,8,FALSE)","v":0},null,0,0,0]
[7,{"$f":"HLOOKUP($H$1,명렬전체!$B$1:$K$32,9,FALSE)","v":0},null,0,0,0]
[8,{"$f":"HLOOKUP($H$1,명렬전체!$B$1:$K$32,10,FALSE)","v":0},null,0,0,0]
[9,{"$f":"HLOOKUP($H$1,명렬전체!$B$1:$K$32,11,FALSE)","v":0},null,0,0,0]
[10,{"$f":"HLOOKUP($H$1,명렬전체!$B$1:$K$32,12,FALSE)","v":0},null,0,0,0]
[11,{"$f":"HLOOKUP($H$1,명렬전체!$B$1:$K$32,13,FALSE)","v":0},null,0,0,0]
[12,{"$f":"HLOOKUP($H$1,명렬전체!$B$1:$K$32,14,FALSE)","v":0},null,0,0,0]
[13,{"$f":"HLOOKUP($H$1,명렬전체!$B$1:$K$32,15,FALSE)","v":0},null,0,0,0]
[14,{"$f":"HLOOKUP($H$1,명렬전체!$B$1:$K$32,16,FALSE)","v":0},null,0,0,0]
[15,{"$f":"HLOOKUP($H$1,명렬전체!$B$1:$K$32,17,FALSE)","v":0},null,0,0,0]
[16,{"$f":"HLOOKUP($H$1,명렬전체!$B$1:$K$32,18,FALSE)","v":0},null,0,0,0]
[17,{"$f":"HLOOKUP($H$1,명렬전체!$B$1:$K$32,19,FALSE)","v":0},null,0,0,0]
[18,{"$f":"HLOOKUP($H$1,명렬전체!$B$1:$K$32,20,FALSE)","v":0},null,0,0,0]
[19,{"$f":"HLOOKUP($H$1,명렬전체!$B$1:$K$32,21,FALSE)","v":0},null,{"$f":"LEN(C20)","v":0},{"$f":"LENB(C20)","v":0},{"$f":"((E20-D20)*3+(D20)*2-(E20))","v":0}]
{"$rows_left_out":15}
{"sheet":"진로","index":4,"n_rows":34,"n_cols":8,"rows_kept":34,"cut":false,"hidden":false,"merged":[]}
["번호","이름","진로활동(총 2100 바이트 - 700자) 바이트계산 : 한글 3, 영문숫자 1, 엔터키 2","문자열","바이트","총 바이트","반입력",{"$f":"'자율(이용안내)'!$H$1","v":9}]
[1,{"$f":"HLOOKUP($H$1,명렬전체!$B$1:$K$32,3,FALSE)","v":0},null,{"$f":"LEN(C2)","v":0},{"$f":"LENB(C2)","v":0},{"$f":"((E2-D2)*3+(D2)*2-(E2))","v":0}]
[{"$f":"A2+1","v":2},{"$f":"HLOOKUP($H$1,명렬전체!$B$1:$K$32,4,FALSE)","v":0},null,{"$f":"LEN(C3)","v":0},{"$f":"LENB(C3)","v":0},{"$f":"((E3-D3)*3+(D3)*2-(E3))","v":0}]
[3,{"$f":"HLOOKUP($H$1,명렬전체!$B$1:$K$32,5,FALSE)","v":0},null,0,0,0]
[4,{"$f":"HLOOKUP($H$1,명렬전체!$B$1:$K$32,6,FALSE)","v":0},null,0,0,0]
[5,{"$f":"HLOOKUP($H$1,명렬전체!$B$1:$K$32,7,FALSE)","v":0},null,0,0,0]
[6,{"$f":"HLOOKUP($H$1,명렬전체!$B$1:$K$32,8,FALSE)","v":0},null,0,0,0]
[7,{"$f":"HLOOKUP($H$1,명렬전체!$B$1:$K$32,9,FALSE)","v":0},null,0,0,0]
[8,{"$f":"HLOOKUP($H$1,명렬전체!$B$1:$K$32,10,FALSE)","v":0},null,0,0,0]
[9,{"$f":"HLOOKUP($H$1,명렬전체!$B$1:$K$32,11,FALSE)","v":0},null,0,0,0]
[10,{"$f":"HLOOKUP($H$1,명렬전체!$B$1:$K$32,12,FALSE)","v":0},null,0,0,0]
[11,{"$f":"HLOOKUP($H$1,명렬전체!$B$1:$K$32,13,FALSE)","v":0},null,0,0,0]
[12,{"$f":"HLOOKUP($H$1,명렬전체!$B$1:$K$32,14,FALSE)","v":0},null,0,0,0]
[13,{"$f":"HLOOKUP($H$1,명렬전체!$B$1:$K$32,15,FALSE)","v":0},null,0,0,0]
[14,{"$f":"HLOOKUP($H$1,명렬전체!$B$1:$K$32,16,FALSE)","v":0},null,0,0,0]
[15,{"$f":"HLOOKUP($H$1,명렬전체!$B$1:$K$32,17,FALSE)","v":0},null,0,0,0]
[16,{"$f":"HLOOKUP($H$1,명렬전체!$B$1:$K$32,18,FALSE)","v":0},null,0,0,0]
[17,{"$f":"HLOOKUP($H$1,명렬전체!$B$1:$K$32,19,FALSE)","v":0},null,0,0,0]
[18,{"$f":"HLOOKUP($H$1,명렬전체!$B$1:$K$32,20,FALSE)","v":0},null,0,0,0]
[19,{"$f":"HLOOKUP($H$1,명렬전체!$B$1:$K$32,21,FALSE)","v":0},null,0,0,0]
{"$rows_left_out":15}
{"sheet":"종합의견","index":5,"n_rows":34,"n_cols":8,"rows_kept":34,"cut":false,"hidden":false,"merged":[]}
["번호","이름","종합의견(총 1500 바이트 - 500자) 바이트계산 : 한글 3, 영문숫자 1, 엔터키 2","문자열","바이트","총 바이트","반입력",{"$f":"'자율(이용안내)'!$H$1","v":9}]
[1,{"$f":"HLOOKUP($H$1,명렬전체!$B$1:$K$32,3,FALSE)","v":0},null,{"$f":"LEN(C2)","v":0},{"$f":"LENB(C2)","v":0},{"$f":"((E2-D2)*3+(D2)*2-(E2))","v":0}]
[{"$f":"A2+1","v":2},{"$f":"HLOOKUP($H$1,명렬전체!$B$1:$K$32,4,FALSE)","v":0},null,{"$f":"LEN(C3)","v":0},{"$f":"LENB(C3)","v":0},{"$f":"((E3-D3)*3+(D3)*2-(E3))","v":0}]
[3,{"$f":"HLOOKUP($H$1,명렬전체!$B$1:$K$32,5,FALSE)","v":0},null,0,0,0]
[4,{"$f":"HLOOKUP($H$1,명렬전체!$B$1:$K$32,6,FALSE)","v":0},null,0,0,0]
[5,{"$f":"HLOOKUP($H$1,명렬전체!$B$1:$K$32,7,FALSE)","v":0},null,0,0,0]
[6,{"$f":"HLOOKUP($H$1,명렬전체!$B$1:$K$32,8,FALSE)","v":0},null,0,0,0]
[7,{"$f":"HLOOKUP($H$1,명렬전체!$B$1:$K$32,9,FALSE)","v":0},null,0,0,0]
[8,{"$f":"HLOOKUP($H$1,명렬전체!$B$1:$K$32,10,FALSE)","v":0},null,0,0,0]
[9,{"$f":"HLOOKUP($H$1,명렬전체!$B$1:$K$32,11,FALSE)","v":0},null,0,0,0]
[10,{"$f":"HLOOKUP($H$1,명렬전체!$B$1:$K$32,12,FALSE)","v":0},null,0,0,0]
[11,{"$f":"HLOOKUP($H$1,명렬전체!$B$1:$K$32,13,FALSE)","v":0},null,0,0,0]
[12,{"$f":"HLOOKUP($H$1,명렬전체!$B$1:$K$32,14,FALSE)","v":0},null,0,0,0]
[13,{"$f":"HLOOKUP($H$1,명렬전체!$B$1:$K$32,15,FALSE)","v":0},null,0,0,0]
[14,{"$f":"HLOOKUP($H$1,명렬전체!$B$1:$K$32,16,FALSE)","v":0},null,0,0,0]
[15,{"$f":"HLOOKUP($H$1,명렬전체!$B$1:$K$32,17,FALSE)","v":0},null,0,0,0]
[16,{"$f":"HLOOKUP($H$1,명렬전체!$B$1:$K$32,18,FALSE)","v":0},null,0,0,0]
[17,{"$f":"HLOOKUP($H$1,명렬전체!$B$1:$K$32,19,FALSE)","v":0},null,0,0,0]
[18,{"$f":"HLOOKUP($H$1,명렬전체!$B$1:$K$32,20,FALSE)","v":0},null,0,0,0]
[19,{"$f":"HLOOKUP($H$1,명렬전체!$B$1:$K$32,21,FALSE)","v":0},null,0,0,0]
{"$rows_left_out":15}
{"sheet":"교과세특","index":6,"n_rows":271,"n_cols":8,"rows_kept":271,"cut":false,"hidden":false,"merged":[]}
["반","반","반","이름","과목세특(1500바이트 - 글자수 500자) 한글 3바이트, 영문숫자 1바이트, 엔터키 2바이트","1한글수","1바이트","총 바이트"]
[{"$f":"10000+B2*100+C2","v":10101},1,1,{"$f":"IF(A2=10000,\"\",VLOOKUP(RIGHT(A2,2)+0,명렬전체!$A$2:$K$40,MID(A2,2,2)+1,FALSE))","v":0},null,{"$f":"LEN(E2)","v":0},{"$f":"LENB(E2)","v":0},{"$f":"((G2-F2)*3+(F2)*2-(G2))","v":0}]
[{"$f":"10000+B3*100+C3","v":10102},1,2,{"$f":"IF(A3=10000,\"\",VLOOKUP(RIGHT(A3,2)+0,명렬전체!$A$2:$K$40,MID(A3,2,2)+1,FALSE))","v":0},null,{"$f":"LEN(E3)","v":0},{"$f":"LENB(E3)","v":0},{"$f":"((G3-F3)*3+(F3)*2-(G3))","v":0}]
[10103,1,3,{"$f":"IF(A4=10000,\"\",VLOOKUP(RIGHT(A4,2)+0,명렬전체!$A$2:$K$40,MID(A4,2,2)+1,FALSE))","v":0},null,0,0,0]
[10104,1,4,{"$f":"IF(A5=10000,\"\",VLOOKUP(RIGHT(A5,2)+0,명렬전체!$A$2:$K$40,MID(A5,2,2)+1,FALSE))","v":0},null,0,0,0]
[10105,1,5,{"$f":"IF(A6=10000,\"\",VLOOKUP(RIGHT(A6,2)+0,명렬전체!$A$2:$K$40,MID(A6,2,2)+1,FALSE))","v":0},null,0,0,0]
[10106,1,6,{"$f":"IF(A7=10000,\"\",VLOOKUP(RIGHT(A7,2)+0,명렬전체!$A$2:$K$40,MID(A7,2,2)+1,FALSE))","v":0},null,0,0,0]
[10107,1,7,{"$f":"IF(A8=10000,\"\",VLOOKUP(RIGHT(A8,2)+0,명렬전체!$A$2:$K$40,MID(A8,2,2)+1,FALSE))","v":0},null,0,0,0]
[10108,1,8,{"$f":"IF(A9=10000,\"\",VLOOKUP(RIGHT(A9,2)+0,명렬전체!$A$2:$K$40,MID(A9,2,2)+1,FALSE))","v":0},null,0,0,0]
[10109,1,9,{"$f":"IF(A10=10000,\"\",VLOOKUP(RIGHT(A10,2)+0,명렬전체!$A$2:$K$40,MID(A10,2,2)+1,FALSE))","v":0},null,0,0,0]
[10110,1,10,{"$f":"IF(A11=10000,\"\",VLOOKUP(RIGHT(A11,2)+0,명렬전체!$A$2:$K$40,MID(A11,2,2)+1,FALSE))","v":0},null,0,0,0]
[10111,1,11,{"$f":"IF(A12=10000,\"\",VLOOKUP(RIGHT(A12,2)+0,명렬전체!$A$2:$K$40,MID(A12,2,2)+1,FALSE))","v":0},null,0,0,0]
[10112,1,12,{"$f":"IF(A13=10000,\"\",VLOOKUP(RIGHT(A13,2)+0,명렬전체!$A$2:$K$40,MID(A13,2,2)+1,FALSE))","v":0},null,0,0,0]
[10113,1,13,{"$f":"IF(A14=10000,\"\",VLOOKUP(RIGHT(A14,2)+0,명렬전체!$A$2:$K$40,MID(A14,2,2)+1,FALSE))","v":0},null,0,0,0]
[10114,1,14,{"$f":"IF(A15=10000,\"\",VLOOKUP(RIGHT(A15,2)+0,명렬전체!$A$2:$K$40,MID(A15,2,2)+1,FALSE))","v":0},null,0,0,0]
[10115,1,15,{"$f":"IF(A16=10000,\"\",VLOOKUP(RIGHT(A16,2)+0,명렬전체!$A$2:$K$40,MID(A16,2,2)+1,FALSE))","v":0},null,0,0,0]
[10116,1,16,{"$f":"IF(A17=10000,\"\",VLOOKUP(RIGHT(A17,2)+0,명렬전체!$A$2:$K$40,MID(A17,2,2)+1,FALSE))","v":0},null,0,0,0]
[10117,1,17,{"$f":"IF(A18=10000,\"\",VLOOKUP(RIGHT(A18,2)+0,명렬전체!$A$2:$K$40,MID(A18,2,2)+1,FALSE))","v":0},null,0,0,0]
[10118,1,18,{"$f":"IF(A19=10000,\"\",VLOOKUP(RIGHT(A19,2)+0,명렬전체!$A$2:$K$40,MID(A19,2,2)+1,FALSE))","v":0},null,0,0,0]
[10119,1,19,{"$f":"IF(A20=10000,\"\",VLOOKUP(RIGHT(A20,2)+0,명렬전체!$A$2:$K$40,MID(A20,2,2)+1,FALSE))","v":0},null,0,0,0]
{"$rows_left_out":252}
{"sheet":"야자출석부(두칸)","index":7,"n_rows":41,"n_cols":34,"rows_kept":41,"cut":false,"hidden":true,"merged":[[39,1,39,2],[40,1,40,2],[0,1,0,2],[0,5,0,6],[0,7,0,33],[2,1,3,1],[2,2,3,2],[2,33,3,33]]}
[null,"2018학년도",null,null,{"$f":"#REF!","v":{"$error":"#REF!"}},"반",null,"               자 율 학 습  출 석 부 ( 3월)"]
[]
[null,"번호","   일자\n\n성 명  .   ","5","월","6","화","7","수","8","목","9","금","12","월","13","화","14","수","15","목","16","금","19","월","20","화","21","수","22","목","23","금","비고"]
[]
[null,1,{"$f":"HLOOKUP($E$1,명렬전체!$B$1:$K$32,3,FALSE)","v":{"$error":"#REF!"}},{"$f":"IF($AH5=\"불참\",\"----------\",IF(ISERROR(SEARCH(\"월\",$AH5,1)>0),\"----------\",\".\"))","v":"."},".",{"$f":"IF($AH5=\"불참\",\"----------\",IF(ISERROR(SEARCH(\"화\",$AH5,1)>0),\"----------\",\".\"))","v":"----------"},"----------",{"$f":"IF($AH5=\"불참\",\"----------\",IF(ISERROR(SEARCH(\"수\",$AH5,1)>0),\"----------\",\".\"))","v":"----------"},"----------",{"$f":"IF($AH5=\"불참\",\"----------\",IF(ISERROR(SEARCH(\"목\",$AH5,1)>0),\"----------\",\".\"))","v":"----------"},{"$f":"IF($AH5=\"----------\",\"----------\",IF(ISERROR(SEARCH(\"목\",$AH5,1)>0),\"----------\",\".\"))","v":"----------"},{"$f":"IF($AH5=\"불참\",\"----------\",IF(ISERROR(SEARCH(\"금\",$AH5,1)>0),\"----------\",\".\"))","v":"----------"},"----------",{"$f":"IF($AH5=\"불참\",\"----------\",IF(ISERROR(SEARCH(\"월\",$AH5,1)>0),\"----------\",\".\"))","v":"."},".",{"$f":"IF($AH5=\"불참\",\"----------\",IF(ISERROR(SEARCH(\"화\",$AH5,1)>0),\"----------\",\".\"))","v":"----------"},"----------",{"$f":"IF($AH5=\"불참\",\"----------\",IF(ISERROR(SEARCH(\"수\",$AH5,1)>0),\"----------\",\".\"))","v":"----------"},"----------",{"$f":"IF($AH5=\"불참\",\"----------\",IF(ISERROR(SEARCH(\"목\",$AH5,1)>0),\"----------\",\".\"))","v":"----------"},"----------",{"$f":"IF($AH5=\"불참\",\"----------\",IF(ISERROR(SEARCH(\"금\",$AH5,1)>0),\"----------\",\".\"))","v":"----------"},"----------",{"$f":"IF($AH5=\"불참\",\"----------\",IF(ISERROR(SEARCH(\"월\",$AH5,1)>0),\"----------\",\".\"))","v":"."},".",{"$f":"IF($AH5=\"불참\",\"----------\",IF(ISERROR(SEARCH(\"화\",$AH5,1)>0),\"----------\",\".\"))","v":"----------"},"----------",{"$f":"IF($AH5=\"불참\",\"----------\",IF(ISERROR(SEARCH(\"수\",$AH5,1)>0),\"----------\",\".\"))","v":"----------"},"----------",{"$f":"IF($AH5=\"불참\",\"----------\",IF(ISERROR(SEARCH(\"목\",$AH5,1)>0),\"----------\",\".\"))","v":"----------"},"----------",{"$f":"IF($AH5=\"불참\",\"----------\",IF(ISERROR(SEARCH(\"금\",$AH5,1)>0),\"----------\",\".\"))","v":"----------"},"----------","월"]
[{"$f":"E$1*100+B6","v":{"$error":"#REF!"}},{"$f":"B5+1","v":2},{"$f":"HLOOKUP($E$1,명렬전체!$B$1:$K$32,4,FALSE)","v":{"$error":"#REF!"}},"----------","----------",".",".",".",".","----------","----------",".",".","----------","----------",".",".",".",".","----------","----------",".",".","----------","----------",".",".",".",".","----------","----------",".",".","화수금"]
[{"$error":"#REF!"},{"$f":"B6+1","v":3},{"$f":"HLOOKUP($E$1,명렬전체!$B$1:$K$32,5,FALSE)","v":{"$error":"#REF!"}},"----------","----------","----------","----------","----------","----------","----------","----------","----------","----------","----------","----------","----------","----------","----------","----------","----------","----------","----------","----------","----------","----------","----------","----------","----------","----------","----------","----------","----------","----------","불참"]
[{"$error":"#REF!"},4,{"$f":"HLOOKUP($E$1,명렬전체!$B$1:$K$32,6,FALSE)","v":{"$error":"#REF!"}},".",".",".",".","----------","----------",".",".",".",".",".",".",".",".","----------","----------",".",".",".",".",".",".",".",".","----------","----------",".",".",".",".","월화목금"]
[{"$error":"#REF!"},5,{"$f":"HLOOKUP($E$1,명렬전체!$B$1:$K$32,7,FALSE)","v":{"$error":"#REF!"}},"----------","----------","----------","----------","----------","----------","----------","----------","----------","----------","----------","----------","----------","----------","----------","----------","----------","----------","----------","----------","----------","----------","----------","----------","----------","----------","----------","----------","----------","----------","불참"]
[{"$error":"#REF!"},6,{"$f":"HLOOKUP($E$1,명렬전체!$B$1:$K$32,8,FALSE)","v":{"$error":"#REF!"}},"----------","----------","----------","----------","----------","----------","----------","----------","----------","----------","----------","----------","----------","----------","----------","----------","----------","----------","----------","----------","----------","----------","----------","----------","----------","----------","----------","----------","----------","----------","불참"]
[{"$error":"#REF!"},7,{"$f":"HLOOKUP($E$1,명렬전체!$B$1:$K$32,9,FALSE)","v":{"$error":"#REF!"}},"----------","----------","----------","----------","----------","----------","----------","----------","----------","----------","----------","----------","----------","----------","----------","----------","----------","----------","----------","----------","----------","----------","----------","----------","----------","----------","----------","----------","----------","----------","불참"]
[{"$error":"#REF!"},8,{"$f":"HLOOKUP($E$1,명렬전체!$B$1:$K$32,10,FALSE)","v":{"$error":"#REF!"}},".",".",".",".",".",".","----------","----------","----------","----------",".",".",".",".",".",".","----------","----------","----------","----------",".",".",".",".",".",".","----------","----------","----------","----------","월화수"]
[{"$error":"#REF!"},9,{"$f":"HLOOKUP($E$1,명렬전체!$B$1:$K$32,11,FALSE)","v":{"$error":"#REF!"}},".",".",".",".","----------","----------",".",".",".",".",".",".",".",".","----------","----------",".",".",".",".",".",".",".",".","----------","----------",".",".",".",".","월화목금"]
[{"$error":"#REF!"},10,{"$f":"HLOOKUP($E$1,명렬전체!$B$1:$K$32,12,FALSE)","v":{"$error":"#REF!"}},".",".","----------","----------",".",".","----------","----------",".",".",".",".","----------","----------",".",".","----------","----------",".",".",".",".","----------","----------",".",".","----------","----------",".",".","월수금"]
[{"$error":"#REF!"},11,{"$f":"HLOOKUP($E$1,명렬전체!$B$1:$K$32,13,FALSE)","v":{"$error":"#REF!"}},"----------","----------","----------","----------","----------","----------","----------","----------","----------","----------","----------","----------","----------","----------","----------","----------","----------","----------","----------","----------","----------","----------","----------","----------","----------","----------","----------","----------","----------","----------","불참"]
[{"$error":"#REF!"},12,{"$f":"HLOOKUP($E$1,명렬전체!$B$1:$K$32,14,FALSE)","v":{"$error":"#REF!"}},".",".","----------","----------",".",".",".",".","----------","----------",".",".","----------","----------",".",".",".",".","----------","----------",".",".","----------","----------",".",".",".",".","----------","----------","월수목"]
[{"$error":"#REF!"},13,{"$f":"HLOOKUP($E$1,명렬전체!$B$1:$K$32,15,FALSE)","v":{"$error":"#REF!"}},".",".",".",".","----------","----------",".",".","----------","----------",".",".",".",".","----------","----------",".",".","----------","----------",".",".",".",".","----------","----------",".",".","----------","----------","월화목"]
[{"$error":"#REF!"},14,{"$f":"HLOOKUP($E$1,명렬전체!$B$1:$K$32,16,FALSE)","v":{"$error":"#REF!"}},".",".","----------","----------",".",".",".",".","----------","----------",".",".","----------","----------",".",".",".",".","----------","----------",".",".","----------","----------",".",".",".",".","----------","----------","월수목"]
[{"$error":"#REF!"},15,{"$f":"HLOOKUP($E$1,명렬전체!$B$1:$K$32,17,FALSE)","v":{"$error":"#REF!"}},".",".","----------","----------","----------","----------",".",".",".",".",".",".","----------","----------","----------","----------",".",".",".",".",".",".","----------","----------","----------","----------",".",".",".",".","월목금"]
[{"$error":"#REF!"},16,{"$f":"HLOOKUP($E$1,명렬전체!$B$1:$K$32,18,FALSE)","v":{"$error":"#REF!"}},"----------","----------","----------","----------","----------","----------","----------","----------","----------","----------","----------","----------","----------","----------","----------","----------","----------","----------","----------","----------","----------","----------","----------","----------","----------","----------","----------","----------","----------","----------","불참"]
{"$rows_left_out":21}