{"text_format":"1","workbook":"xlsx","n_sheets":8,"sheets":["사용안내","연간","달력","일정","공휴일","디데이","예제 파일","이름지정"],"not_rendered":{"charts":0,"images":2,"macros":1,"external_links":0,"defined_names":20,"comments":3,"pivot_tables":0},"unopened":[],"bounds":{"document_bytes":16777216,"sheet_cells":100000,"rows_first":2000,"rows_last":500,"rows_between":2000,"halvings":0,"cell_chars":16384,"cell_head_chars":4096},"cells_cut":0,"cells_raw":0,"read":"whole","date_system":"1900"}

{"sheet":"사용안내","index":0,"n_rows":30,"n_cols":7,"rows_kept":30,"cut":false,"hidden":false,"merged":[[0,1,0,10],[17,1,17,10],[6,1,6,5],[6,6,6,10],[7,1,7,5],[8,1,8,5],[9,1,9,5],[10,1,10,5],[2,1,2,10],[3,1,3,10],[4,1,4,10],[7,6,7,10],[8,6,8,10],[9,6,9,10],[10,6,10,10],[11,6,11,10],[28,1,28,10],[29,1,29,10],[13,1,13,10],[14,1,14,10],[15,1,15,10],[20,1,20,10],[22,1,22,10],[23,1,23,10],[24,1,24,10],[25,1,25,10],[27,1,27,10],[19,1,19,10],[18,1,18,10]]}
[null,"탭다 엑셀 양식 사용 안내"]
[]
[null,"탭다 블로그 내 엑셀 양식은"]
[null,"사용 범위를 준수할 경우 모두 무료입니다. "]
[null,"금지 사항 적발 시 관련법에 의거 제재 및 법적 처벌을 받을 수 있습니다."]
[]
[null,"O",null,null,null,null,"X"]
[null,"개인적 비상업적 용도의 사용",null,null,null,null,"디자인 무단 도용 및 판매 금지"]
[null,"온라인 및 오프라인 이용 가능",null,null,null,null,"재배포(개인적, 비상업적 용도라도) 금지"]
[null,"회사원 개인의 회사 내부 보고, 제출, 공유용",null,null,null,null,"외부 유출, 대외적 게시 금지"]
[null,"비영리 단체에서의 사용",null,null,null,null,"영리 목적의 강의에 사용 금지"]
[null,null,null,null,null,null,"기타 이에 준하는 모든 상업적 유사 행위 금지"]
[]
[null,"탭다의 최신 소식을 가장 빨리 받는 방법!"]
[null,"카카오톡 친구 검색에서 '탭다'를 찾아 친구 추가하기!"]
[null,"탭다 블로그 북마크 또는 즐겨찾기 http://tabda.tistory.com"]
[]
[null,"탭다 엑셀 양식이 마음에 드셨나요?"]
[null,"지금 블로그, SNS에 탭다를 홍보해주세요."]
[null,"#탭다, #무료엑셀양식, #고퀄리티, #개이득"]
[null,"여러분들의 우쭈쭈는 저에게 큰 힘이 됩니다."]
[]
[null,"탭다 엑셀 양식이 유용하셨나요?"]
[null,"앞으로도 고퀄리티 엑셀 양식이 꾸준히"]
[null,"만들어질 수 있도록 탭다를 후원해주세요."]
[null,"여러분들의 피드백에 더 나은 컨텐츠 제작으로 보답하겠습니다."]
[]
[null,"네이버 페이 포인트 선물하기 : mkjang0202 장민경"]
[null,"계좌 후원 : 국민은행 240802-04-160014 장민경"]
[null,"후원 및 기타 문의 : 카카오톡 '탭다' 검색 → 채널 친구추가 또는 오픈채팅"]

{"sheet":"연간","index":1,"n_rows":32,"n_cols":32,"rows_kept":32,"cut":false,"hidden":false,"merged":[[1,14,1,18]]}
[]
[null,"S",null,null,null,null,null,null,null,null,null,null,null,null,2022]
[]
[null,null,null,null,1,null,null,null,null,null,null,null,2,null,null,null,null,null,null,null,3,null,null,null,null,null,null,null,4]
[]
[null,{"$f":"IF($B$2=\"S\",\"S\",IF($B$2=\"M\",\"M\"))","v":"S"},{"$f":"IF($B$2=\"S\",\"M\",IF($B$2=\"M\",\"T\"))","v":"M"},{"$f":"IF($B$2=\"S\",\"T\",IF($B$2=\"M\",\"W\"))","v":"T"},{"$f":"IF($B$2=\"S\",\"W\",IF($B$2=\"M\",\"T\"))","v":"W"},{"$f":"IF($B$2=\"S\",\"T\",IF($B$2=\"M\",\"F\"))","v":"T"},{"$f":"IF($B$2=\"S\",\"F\",IF($B$2=\"M\",\"S\"))","v":"F"},"S",null,{"$f":"IF($B$2=\"S\",\"S\",IF($B$2=\"M\",\"M\"))","v":"S"},{"$f":"IF($B$2=\"S\",\"M\",IF($B$2=\"M\",\"T\"))","v":"M"},{"$f":"IF($B$2=\"S\",\"T\",IF($B$2=\"M\",\"W\"))","v":"T"},{"$f":"IF($B$2=\"S\",\"W\",IF($B$2=\"M\",\"T\"))","v":"W"},{"$f":"IF($B$2=\"S\",\"T\",IF($B$2=\"M\",\"F\"))","v":"T"},{"$f":"IF($B$2=\"S\",\"F\",IF($B$2=\"M\",\"S\"))","v":"F"},"S",null,{"$f":"IF($B$2=\"S\",\"S\",IF($B$2=\"M\",\"M\"))","v":"S"},{"$f":"IF($B$2=\"S\",\"M\",IF($B$2=\"M\",\"T\"))","v":"M"},{"$f":"IF($B$2=\"S\",\"T\",IF($B$2=\"M\",\"W\"))","v":"T"},{"$f":"IF($B$2=\"S\",\"W\",IF($B$2=\"M\",\"T\"))","v":"W"},{"$f":"IF($B$2=\"S\",\"T\",IF($B$2=\"M\",\"F\"))","v":"T"},{"$f":"IF($B$2=\"S\",\"F\",IF($B$2=\"M\",\"S\"))","v":"F"},"S",null,{"$f":"IF($B$2=\"S\",\"S\",IF($B$2=\"M\",\"M\"))","v":"S"},{"$f":"IF($B$2=\"S\",\"M\",IF($B$2=\"M\",\"T\"))","v":"M"},{"$f":"IF($B$2=\"S\",\"T\",IF($B$2=\"M\",\"W\"))","v":"T"},{"$f":"IF($B$2=\"S\",\"W\",IF($B$2=\"M\",\"T\"))","v":"W"},{"$f":"IF($B$2=\"S\",\"T\",IF($B$2=\"M\",\"F\"))","v":"T"},{"$f":"IF($B$2=\"S\",\"F\",IF($B$2=\"M\",\"S\"))","v":"F"},"S"]
[null,{"$f":"IF(B2=\"M\",(IF(DAY(DATE($O$2,$E$4,1)-WEEKDAY(DATE($O$2,$E$4,1))+2)=2,DATE($O$2,$E$4,1)-WEEKDAY(DATE($O$2,$E$4,1))-5,DATE($O$2,$E$4,1)-WEEKDAY(DATE($O$2,$E$4,1))+2)),IF(B2=\"S\",DATE($O$2,$E$4,1)-WEEKDAY(DATE($O$2,$E$4,1))+1))","v":"2021-12-26"},{"$f":"B7+1","v":"2021-12-27"},"2021-12-28","2021-12-29","2021-12-30","2021-12-31","2022-01-01",null,{"$f":"IF(B2=\"M\",(IF(DAY(DATE($O$2,$M$4,1)-WEEKDAY(DATE($O$2,$M$4,1))+2)=2,DATE($O$2,$M$4,1)-WEEKDAY(DATE($O$2,$M$4,1))-5,DATE($O$2,$M$4,1)-WEEKDAY(DATE($O$2,$M$4,1))+2)),IF(B2=\"S\",DATE($O$2,$M$4,1)-WEEKDAY(DATE($O$2,$M$4,1))+1))","v":"2022-01-30"},{"$f":"J7+1","v":"2022-01-31"},"2022-02-01","2022-02-02","2022-02-03","2022-02-04","2022-02-05",null,{"$f":"IF(B2=\"M\",(IF(DAY(DATE($O$2,$U$4,1)-WEEKDAY(DATE($O$2,$U$4,1))+2)=2,DATE($O$2,$U$4,1)-WEEKDAY(DATE($O$2,$U$4,1))-5,DATE($O$2,$U$4,1)-WEEKDAY(DATE($O$2,$U$4,1))+2)),IF(B2=\"S\",DATE($O$2,$U$4,1)-WEEKDAY(DATE($O$2,$U$4,1))+1))","v":"2022-02-27"},{"$f":"R7+1","v":"2022-02-28"},"2022-03-01","2022-03-02","2022-03-03","2022-03-04","2022-03-05",null,{"$f":"IF(B2=\"M\",(IF(DAY(DATE($O$2,$AC$4,1)-WEEKDAY(DATE($O$2,$AC$4,1))+2)=2,DATE($O$2,$AC$4,1)-WEEKDAY(DATE($O$2,$AC$4,1))-5,DATE($O$2,$AC$4,1)-WEEKDAY(DATE($O$2,$AC$4,1))+2)),IF(B2=\"S\",DATE($O$2,$AC$4,1)-WEEKDAY(DATE($O$2,$AC$4,1))+1))","v":"2022-03-27"},{"$f":"Z7+1","v":"2022-03-28"},"2022-03-29","2022-03-30","2022-03-31","2022-04-01","2022-04-02"]
[null,{"$f":"B7+7","v":"2022-01-02"},{"$f":"C7+7","v":"2022-01-03"},"2022-01-04","2022-01-05","2022-01-06","2022-01-07","2022-01-08",null,{"$f":"J7+7","v":"2022-02-06"},"2022-02-07","2022-02-08","2022-02-09","2022-02-10","2022-02-11","2022-02-12",null,{"$f":"R7+7","v":"2022-03-06"},"2022-03-07","2022-03-08","2022-03-09","2022-03-10","2022-03-11","2022-03-12",null,{"$f":"Z7+7","v":"2022-04-03"},"2022-04-04","2022-04-05","2022-04-06","2022-04-07","2022-04-08","2022-04-09"]
[null,{"$f":"B8+7","v":"2022-01-09"},"2022-01-10","2022-01-11","2022-01-12","2022-01-13","2022-01-14","2022-01-15",null,"2022-02-13","2022-02-14","2022-02-15","2022-02-16","2022-02-17","2022-02-18","2022-02-19",null,"2022-03-13","2022-03-14","2022-03-15","2022-03-16","2022-03-17","2022-03-18","2022-03-19",null,"2022-04-10","2022-04-11","2022-04-12","2022-04-13","2022-04-14","2022-04-15","2022-04-16"]
[null,{"$f":"B9+7","v":"2022-01-16"},"2022-01-17","2022-01-18","2022-01-19","2022-01-20","2022-01-21","2022-01-22",null,"2022-02-20","2022-02-21","2022-02-22","2022-02-23","2022-02-24","2022-02-25","2022-02-26",null,"2022-03-20","2022-03-21","2022-03-22","2022-03-23","2022-03-24","2022-03-25","2022-03-26",null,"2022-04-17","2022-04-18","2022-04-19","2022-04-20","2022-04-21","2022-04-22","2022-04-23"]
[null,{"$f":"B10+7","v":"2022-01-23"},"2022-01-24","2022-01-25","2022-01-26","2022-01-27","2022-01-28","2022-01-29",null,"2022-02-27","2022-02-28","2022-03-01","2022-03-02","2022-03-03","2022-03-04","2022-03-05",null,"2022-03-27","2022-03-28","2022-03-29","2022-03-30","2022-03-31","2022-04-01","2022-04-02",null,"2022-04-24","2022-04-25","2022-04-26","2022-04-27","2022-04-28","2022-04-29","2022-04-30"]
[null,{"$f":"B11+7","v":"2022-01-30"},"2022-01-31","2022-02-01","2022-02-02","2022-02-03","2022-02-04","2022-02-05",null,"2022-03-06","2022-03-07","2022-03-08","2022-03-09","2022-03-10","2022-03-11","2022-03-12",null,"2022-04-03","2022-04-04","2022-04-05","2022-04-06","2022-04-07","2022-04-08","2022-04-09",null,"2022-05-01","2022-05-02","2022-05-03","2022-05-04","2022-05-05","2022-05-06","2022-05-07"]
[]
[null,null,null,null,5,null,null,null,null,null,null,null,6,null,null,null,null,null,null,null,7,null,null,null,null,null,null,null,8]
[]
[null,{"$f":"IF($B$2=\"S\",\"S\",IF($B$2=\"M\",\"M\"))","v":"S"},{"$f":"IF($B$2=\"S\",\"M\",IF($B$2=\"M\",\"T\"))","v":"M"},{"$f":"IF($B$2=\"S\",\"T\",IF($B$2=\"M\",\"W\"))","v":"T"},{"$f":"IF($B$2=\"S\",\"W\",IF($B$2=\"M\",\"T\"))","v":"W"},{"$f":"IF($B$2=\"S\",\"T\",IF($B$2=\"M\",\"F\"))","v":"T"},{"$f":"IF($B$2=\"S\",\"F\",IF($B$2=\"M\",\"S\"))","v":"F"},"S",null,{"$f":"IF($B$2=\"S\",\"S\",IF($B$2=\"M\",\"M\"))","v":"S"},{"$f":"IF($B$2=\"S\",\"M\",IF($B$2=\"M\",\"T\"))","v":"M"},{"$f":"IF($B$2=\"S\",\"T\",IF($B$2=\"M\",\"W\"))","v":"T"},{"$f":"IF($B$2=\"S\",\"W\",IF($B$2=\"M\",\"T\"))","v":"W"},{"$f":"IF($B$2=\"S\",\"T\",IF($B$2=\"M\",\"F\"))","v":"T"},{"$f":"IF($B$2=\"S\",\"F\",IF($B$2=\"M\",\"S\"))","v":"F"},"S",null,{"$f":"IF($B$2=\"S\",\"S\",IF($B$2=\"M\",\"M\"))","v":"S"},{"$f":"IF($B$2=\"S\",\"M\",IF($B$2=\"M\",\"T\"))","v":"M"},{"$f":"IF($B$2=\"S\",\"T\",IF($B$2=\"M\",\"W\"))","v":"T"},{"$f":"IF($B$2=\"S\",\"W\",IF($B$2=\"M\",\"T\"))","v":"W"},{"$f":"IF($B$2=\"S\",\"T\",IF($B$2=\"M\",\"F\"))","v":"T"},{"$f":"IF($B$2=\"S\",\"F\",IF($B$2=\"M\",\"S\"))","v":"F"},"S",null,{"$f":"IF($B$2=\"S\",\"S\",IF($B$2=\"M\",\"M\"))","v":"S"},{"$f":"IF($B$2=\"S\",\"M\",IF($B$2=\"M\",\"T\"))","v":"M"},{"$f":"IF($B$2=\"S\",\"T\",IF($B$2=\"M\",\"W\"))","v":"T"},{"$f":"IF($B$2=\"S\",\"W\",IF($B$2=\"M\",\"T\"))","v":"W"},{"$f":"IF($B$2=\"S\",\"T\",IF($B$2=\"M\",\"F\"))","v":"T"},{"$f":"IF($B$2=\"S\",\"F\",IF($B$2=\"M\",\"S\"))","v":"F"},"S"]
[null,{"$f":"IF(B2=\"M\",(IF(DAY(DATE($O$2,$E$14,1)-WEEKDAY(DATE($O$2,$E$14,1))+2)=2,DATE($O$2,$E$14,1)-WEEKDAY(DATE($O$2,$E$14,1))-5,DATE($O$2,$E$14,1)-WEEKDAY(DATE($O$2,$E$14,1))+2)),IF(B2=\"S\",DATE($O$2,$E$14,1)-WEEKDAY(DATE($O$2,$E$14,1))+1))","v":"2022-05-01"},{"$f":"B17+1","v":"2022-05-02"},"2022-05-03","2022-05-04","2022-05-05","2022-05-06","2022-05-07",null,{"$f":"IF(B2=\"M\",(IF(DAY(DATE($O$2,$M$14,1)-WEEKDAY(DATE($O$2,$M$14,1))+2)=2,DATE($O$2,$M$14,1)-WEEKDAY(DATE($O$2,$M$14,1))-5,DATE($O$2,$M$14,1)-WEEKDAY(DATE($O$2,$M$14,1))+2)),IF(B2=\"S\",DATE($O$2,$M$14,1)-WEEKDAY(DATE($O$2,$M$14,1))+1))","v":"2022-05-29"},{"$f":"J17+1","v":"2022-05-30"},"2022-05-31","2022-06-01","2022-06-02","2022-06-03","2022-06-04",null,{"$f":"IF(B2=\"M\",(IF(DAY(DATE($O$2,$U$14,1)-WEEKDAY(DATE($O$2,$U$14,1))+2)=2,DATE($O$2,$U$14,1)-WEEKDAY(DATE($O$2,$U$14,1))-5,DATE($O$2,$U$14,1)-WEEKDAY(DATE($O$2,$U$14,1))+2)),IF(B2=\"S\",DATE($O$2,$U$14,1)-WEEKDAY(DATE($O$2,$U$14,1))+1))","v":"2022-06-26"},{"$f":"R17+1","v":"2022-06-27"},"2022-06-28","2022-06-29","2022-06-30","2022-07-01","2022-07-02",null,{"$f":"IF(B2=\"M\",(IF(DAY(DATE($O$2,$AC$14,1)-WEEKDAY(DATE($O$2,$AC$14,1))+2)=2,DATE($O$2,$AC$14,1)-WEEKDAY(DATE($O$2,$AC$14,1))-5,DATE($O$2,$AC$14,1)-WEEKDAY(DATE($O$2,$AC$14,1))+2)),IF(B2=\"S\",DATE($O$2,$AC$14,1)-WEEKDAY(DATE($O$2,$AC$14,1))+1))","v":"2022-07-31"},{"$f":"Z17+1","v":"2022-08-01"},"2022-08-02","2022-08-03","2022-08-04","2022-08-05","2022-08-06"]
[null,{"$f":"B17+7","v":"2022-05-08"},"2022-05-09","2022-05-10","2022-05-11","2022-05-12","2022-05-13","2022-05-14",null,{"$f":"J17+7","v":"2022-06-05"},"2022-06-06","2022-06-07","2022-06-08","2022-06-09","2022-06-10","2022-06-11",null,{"$f":"R17+7","v":"2022-07-03"},"2022-07-04","2022-07-05","2022-07-06","2022-07-07","2022-07-08","2022-07-09",null,{"$f":"Z17+7","v":"2022-08-07"},"2022-08-08","2022-08-09","2022-08-10","2022-08-11","2022-08-12","2022-08-13"]
[null,"2022-05-15","2022-05-16","2022-05-17","2022-05-18","2022-05-19","2022-05-20","2022-05-21",null,"2022-06-12","2022-06-13","2022-06-14","2022-06-15","2022-06-16","2022-06-17","2022-06-18",null,"2022-07-10","2022-07-11","2022-07-12","2022-07-13","2022-07-14","2022-07-15","2022-07-16",null,"2022-08-14","2022-08-15","2022-08-16","2022-08-17","2022-08-18","2022-08-19","2022-08-20"]
[null,"2022-05-22","2022-05-23","2022-05-24","2022-05-25","2022-05-26","2022-05-27","2022-05-28",null,"2022-06-19","2022-06-20","2022-06-21","2022-06-22","2022-06-23","2022-06-24","2022-06-25",null,"2022-07-17","2022-07-18","2022-07-19","2022-07-20","2022-07-21","2022-07-22","2022-07-23",null,"2022-08-21","2022-08-22","2022-08-23","2022-08-24","2022-08-25","2022-08-26","2022-08-27"]
[null,"2022-05-29","2022-05-30","2022-05-31","2022-06-01","2022-06-02","2022-06-03","2022-06-04",null,"2022-06-26","2022-06-27","2022-06-28","2022-06-29","2022-06-30","2022-07-01","2022-07-02",null,"2022-07-24","2022-07-25","2022-07-26","2022-07-27","2022-07-28","2022-07-29","2022-07-30",null,"2022-08-28","2022-08-29","2022-08-30","2022-08-31","2022-09-01","2022-09-02","2022-09-03"]
[null,"2022-06-05","2022-06-06","2022-06-07","2022-06-08","2022-06-09","2022-06-10","2022-06-11",null,"2022-07-03","2022-07-04","2022-07-05","2022-07-06","2022-07-07","2022-07-08","2022-07-09",null,"2022-07-31","2022-08-01","2022-08-02","2022-08-03","2022-08-04","2022-08-05","2022-08-06",null,"2022-09-04","2022-09-05","2022-09-06","2022-09-07","2022-09-08","2022-09-09","2022-09-10"]
[]
[null,null,null,null,9,null,null,null,null,null,null,null,10,null,null,null,null,null,null,null,11,null,null,null,null,null,null,null,12]
[]
[null,{"$f":"IF($B$2=\"S\",\"S\",IF($B$2=\"M\",\"M\"))","v":"S"},{"$f":"IF($B$2=\"S\",\"M\",IF($B$2=\"M\",\"T\"))","v":"M"},{"$f":"IF($B$2=\"S\",\"T\",IF($B$2=\"M\",\"W\"))","v":"T"},{"$f":"IF($B$2=\"S\",\"W\",IF($B$2=\"M\",\"T\"))","v":"W"},{"$f":"IF($B$2=\"S\",\"T\",IF($B$2=\"M\",\"F\"))","v":"T"},{"$f":"IF($B$2=\"S\",\"F\",IF($B$2=\"M\",\"S\"))","v":"F"},"S",null,{"$f":"IF($B$2=\"S\",\"S\",IF($B$2=\"M\",\"M\"))","v":"S"},{"$f":"IF($B$2=\"S\",\"M\",IF($B$2=\"M\",\"T\"))","v":"M"},{"$f":"IF($B$2=\"S\",\"T\",IF($B$2=\"M\",\"W\"))","v":"T"},{"$f":"IF($B$2=\"S\",\"W\",IF($B$2=\"M\",\"T\"))","v":"W"},{"$f":"IF($B$2=\"S\",\"T\",IF($B$2=\"M\",\"F\"))","v":"T"},{"$f":"IF($B$2=\"S\",\"F\",IF($B$2=\"M\",\"S\"))","v":"F"},"S",null,{"$f":"IF($B$2=\"S\",\"S\",IF($B$2=\"M\",\"M\"))","v":"S"},{"$f":"IF($B$2=\"S\",\"M\",IF($B$2=\"M\",\"T\"))","v":"M"},{"$f":"IF($B$2=\"S\",\"T\",IF($B$2=\"M\",\"W\"))","v":"T"},{"$f":"IF($B$2=\"S\",\"W\",IF($B$2=\"M\",\"T\"))","v":"W"},{"$f":"IF($B$2=\"S\",\"T\",IF($B$2=\"M\",\"F\"))","v":"T"},{"$f":"IF($B$2=\"S\",\"F\",IF($B$2=\"M\",\"S\"))","v":"F"},"S",null,{"$f":"IF($B$2=\"S\",\"S\",IF($B$2=\"M\",\"M\"))","v":"S"},{"$f":"IF($B$2=\"S\",\"M\",IF($B$2=\"M\",\"T\"))","v":"M"},{"$f":"IF($B$2=\"S\",\"T\",IF($B$2=\"M\",\"W\"))","v":"T"},{"$f":"IF($B$2=\"S\",\"W\",IF($B$2=\"M\",\"T\"))","v":"W"},{"$f":"IF($B$2=\"S\",\"T\",IF($B$2=\"M\",\"F\"))","v":"T"},{"$f":"IF($B$2=\"S\",\"F\",IF($B$2=\"M\",\"S\"))","v":"F"},"S"]
[null,{"$f":"IF(B2=\"M\",(IF(DAY(DATE($O$2,$E$24,1)-WEEKDAY(DATE($O$2,$E$24,1))+2)=2,DATE($O$2,$E$24,1)-WEEKDAY(DATE($O$2,$E$24,1))-5,DATE($O$2,$E$24,1)-WEEKDAY(DATE($O$2,$E$24,1))+2)),IF(B2=\"S\",DATE($O$2,$E$24,1)-WEEKDAY(DATE($O$2,$E$24,1))+1))","v":"2022-08-28"},{"$f":"B27+1","v":"2022-08-29"},"2022-08-30","2022-08-31","2022-09-01","2022-09-02","2022-09-03",null,{"$f":"IF(B2=\"M\",(IF(DAY(DATE($O$2,$M$24,1)-WEEKDAY(DATE($O$2,$M$24,1))+2)=2,DATE($O$2,$M$24,1)-WEEKDAY(DATE($O$2,$M$24,1))-5,DATE($O$2,$M$24,1)-WEEKDAY(DATE($O$2,$M$24,1))+2)),IF(B2=\"S\",DATE($O$2,$M$24,1)-WEEKDAY(DATE($O$2,$E$4,1))+1))","v":"2022-09-25"},{"$f":"J27+1","v":"2022-09-26"},"2022-09-27","2022-09-28","2022-09-29","2022-09-30","2022-10-01",null,{"$f":"IF(B2=\"M\",(IF(DAY(DATE($O$2,$U$24,1)-WEEKDAY(DATE($O$2,$U$24,1))+2)=2,DATE($O$2,$U$24,1)-WEEKDAY(DATE($O$2,$U$24,1))-5,DATE($O$2,$U$24,1)-WEEKDAY(DATE($O$2,$U$24,1))+2)),IF(B2=\"S\",DATE($O$2,$U$24,1)-WEEKDAY(DATE($O$2,$U$24,1))+1))","v":"2022-10-30"},{"$f":"R27+1","v":"2022-10-31"},"2022-11-01","2022-11-02","2022-11-03","2022-11-04","2022-11-05",null,{"$f":"IF(B2=\"M\",(IF(DAY(DATE($O$2,$AC$24,1)-WEEKDAY(DATE($O$2,$AC$24,1))+2)=2,DATE($O$2,$AC$24,1)-WEEKDAY(DATE($O$2,$AC$24,1))-5,DATE($O$2,$AC$24,1)-WEEKDAY(DATE($O$2,$AC$24,1))+2)),IF(B2=\"S\",DATE($O$2,$AC$24,1)-WEEKDAY(DATE($O$2,$AC$24,1))+1))","v":"2022-11-27"},{"$f":"Z27+1","v":"2022-11-28"},"2022-11-29","2022-11-30","2022-12-01","2022-12-02","2022-12-03"]
[null,{"$f":"B27+7","v":"2022-09-04"},"2022-09-05","2022-09-06","2022-09-07","2022-09-08","2022-09-09","2022-09-10",null,{"$f":"J27+7","v":"2022-10-02"},"2022-10-03","2022-10-04","2022-10-05","2022-10-06","2022-10-07","2022-10-08",null,{"$f":"R27+7","v":"2022-11-06"},"2022-11-07","2022-11-08","2022-11-09","2022-11-10","2022-11-11","2022-11-12",null,{"$f":"Z27+7","v":"2022-12-04"},"2022-12-05","2022-12-06","2022-12-07","2022-12-08","2022-12-09","2022-12-10"]
[null,"2022-09-11","2022-09-12","2022-09-13","2022-09-14","2022-09-15","2022-09-16","2022-09-17",null,"2022-10-09","2022-10-10","2022-10-11","2022-10-12","2022-10-13","2022-10-14","2022-10-15",null,"2022-11-13","2022-11-14","2022-11-15","2022-11-16","2022-11-17","2022-11-18","2022-11-19",null,"2022-12-11","2022-12-12","2022-12-13","2022-12-14","2022-12-15","2022-12-16","2022-12-17"]
[null,"2022-09-18","2022-09-19","2022-09-20","2022-09-21","2022-09-22","2022-09-23","2022-09-24",null,"2022-10-16","2022-10-17","2022-10-18","2022-10-19","2022-10-20","2022-10-21","2022-10-22",null,"2022-11-20","2022-11-21","2022-11-22","2022-11-23","2022-11-24","2022-11-25","2022-11-26",null,"2022-12-18","2022-12-19","2022-12-20","2022-12-21","2022-12-22","2022-12-23","2022-12-24"]
[null,"2022-09-25","2022-09-26","2022-09-27","2022-09-28","2022-09-29","2022-09-30","2022-10-01",null,"2022-10-23","2022-10-24","2022-10-25","2022-10-26","2022-10-27","2022-10-28","2022-10-29",null,"2022-11-27","2022-11-28","2022-11-29","2022-11-30","2022-12-01","2022-12-02","2022-12-03",null,"2022-12-25","2022-12-26","2022-12-27","2022-12-28","2022-12-29","2022-12-30","2022-12-31"]
[null,"2022-10-02","2022-10-03","2022-10-04","2022-10-05","2022-10-06","2022-10-07","2022-10-08",null,"2022-10-30","2022-10-31","2022-11-01","2022-11-02","2022-11-03","2022-11-04","2022-11-05",null,"2022-12-04","2022-12-05","2022-12-06","2022-12-07","2022-12-08","2022-12-09","2022-12-10",null,"2023-01-01","2023-01-02","2023-01-03","2023-01-04","2023-01-05","2023-01-06","2023-01-07"]

{"sheet":"달력","index":2,"n_rows":4948,"n_cols":36,"rows_kept":4948,"cut":false,"hidden":false,"merged":[[37,3,37,4],[38,3,38,4],[39,3,39,4],[40,3,40,4],[40,1,40,2],[39,1,39,2],[38,1,38,2],[37,1,37,2],[40,9,40,10],[39,9,39,10],[38,9,38,10],[37,9,37,10],[37,7,37,8],[38,7,38,8],[39,7,39,8],[40,7,40,8],[40,5,40,6],[39,5,39,6],[38,5,38,6],[37,5,37,6],[41,11,41,12],[41,13,41,14],[40,13,40,14],[39,13,39,14],[38,13,38,14],[37,13,37,14],[37,11,37,12],[38,11,38,12],[39,11,39,12],[40,11,40,12],[7,3,7,4],[7,5,7,6],[7,7,7,8],[7,9,7,10],[7,11,7,12],[7,13,7,14],[5,1,5,2],[5,3,5,4],[1,1,3,2],[5,11,5,12],[5,9,5,10],[5,13,5,14],[5,5,5,6],[5,7,5,8],[1,9,1,14],[2,9,2,14],[3,9,3,14],[2,3,3,3],[7,1,7,2],[8,13,8,14],[9,1,9,2],[9,3,9,4],[9,5,9,6],[9,7,9,8],[9,9,9,10],[9,11,9,12],[9,13,9,14],[8,1,8,2],[8,3,8,4],[8,5,8,6],[8,7,8,8],[8,9,8,10],[8,11,8,12],[10,13,10,14],[11,1,11,2],[11,3,11,4],[11,5,11,6],[11,7,11,8],[11,9,11,10],[11,11,11,12],[11,13,11,14],[10,1,10,2],[10,3,10,4],[10,5,10,6],[10,7,10,8],[10,9,10,10],[10,11,10,12],[13,13,13,14],[14,1,14,2],[14,3,14,4],[14,5,14,6],[14,7,14,8],[14,9,14,10],[14,11,14,12],[14,13,14,14],[13,1,13,2],[13,3,13,4],[13,5,13,6],[13,7,13,8],[13,9,13,10],[13,11,13,12],[15,13,15,14],[16,1,16,2],[16,3,16,4],[16,5,16,6],[16,7,16,8],[16,9,16,10],[16,11,16,12],[16,13,16,14],[15,1,15,2],[15,3,15,4],[15,5,15,6],[15,7,15,8],[15,9,15,10],[15,11,15,12],[17,13,17,14],[19,1,19,2],[19,3,19,4],[19,5,19,6],[19,7,19,8],[19,9,19,10],[19,11,19,12],[19,13,19,14],[17,1,17,2],[17,3,17,4],[17,5,17,6],[17,7,17,8],[17,9,17,10],[17,11,17,12],[20,13,20,14],[21,1,21,2],[21,3,21,4],[21,5,21,6],[21,7,21,8],[21,9,21,10],[21,11,21,12],[21,13,21,14],[20,1,20,2],[20,3,20,4],[20,5,20,6],[20,7,20,8],[20,9,20,10],[20,11,20,12],[22,13,22,14],[23,1,23,2],[23,3,23,4],[23,5,23,6],[23,7,23,8],[23,9,23,10],[23,11,23,12],[23,13,23,14],[22,1,22,2],[22,3,22,4],[22,5,22,6],[22,7,22,8],[22,9,22,10],[22,11,22,12],[25,13,25,14],[26,1,26,2],[26,3,26,4],[26,5,26,6],[26,7,26,8],[26,9,26,10],[26,11,26,12],[26,13,26,14],[25,1,25,2],[25,3,25,4],[25,5,25,6],[25,7,25,8],[25,9,25,10],[25,11,25,12],[27,13,27,14],[28,1,28,2],[28,3,28,4],[28,5,28,6],[28,7,28,8],[28,9,28,10],[28,11,28,12],[28,13,28,14],[27,1,27,2],[27,3,27,4],[27,5,27,6],[27,7,27,8],[27,9,27,10],[27,11,27,12],[29,13,29,14],[31,1,31,2],[31,3,31,4],[31,5,31,6],[31,7,31,8],[31,9,31,10],[31,11,31,12],[31,13,31,14],[29,1,29,2],[29,3,29,4],[29,5,29,6],[29,7,29,8],[29,9,29,10],[29,11,29,12],[32,13,32,14],[33,1,33,2],[33,3,33,4],[33,5,33,6],[33,7,33,8],[33,9,33,10],[33,11,33,12],[33,13,33,14],[32,1,32,2],[32,3,32,4],[32,5,32,6],[32,7,32,8],[32,9,32,10],[32,11,32,12],[49,11,49,12],[49,13,49,14],[50,11,50,12],[50,13,50,14],[52,11,52,14],[34,13,34,14],[35,1,35,2],[35,3,35,4],[35,5,35,6],[35,7,35,8],[35,9,35,10],[35,11,35,12],[35,13,35,14],[34,1,34,2],[34,3,34,4],[34,5,34,6],[34,7,34,8],[34,9,34,10],[34,11,34,12],[41,1,41,2],[41,3,41,4],[41,5,41,6],[41,7,41,8],[41,9,41,10]]}
[]
[null,5,null,{"$f":"연간!$O$2","v":2022}]
[null,null,null,{"$f":"TEXT(DATE(D2,B2,1),\"mmmm\")","v":"May"}]
[null,null,null,null,null,null,null,null,null,"MADE BY 엠키(tabda.tistory.com)"]
[null,null,null,null,null,null,null,null,null,null,null,null,null,null,null,null,null,"↑클릭 전 주의해주세요!"]
[null,{"$f":"IF(연간!$B$2=\"S\",\"SUN\",IF(연간!$B$2=\"M\",\"MON\"))","v":"SUN"},null,{"$f":"IF(연간!$B$2=\"S\",\"MON\",IF(연간!$B$2=\"M\",\"TUE\"))","v":"MON"},null,{"$f":"IF(연간!$B$2=\"S\",\"TUE\",IF(연간!$B$2=\"M\",\"WED\"))","v":"TUE"},null,{"$f":"IF(연간!$B$2=\"S\",\"WED\",IF(연간!$B$2=\"M\",\"THU\"))","v":"WED"},null,{"$f":"IF(연간!$B$2=\"S\",\"THU\",IF(연간!$B$2=\"M\",\"FRI\"))","v":"THU"},null,{"$f":"IF(연간!$B$2=\"S\",\"FRI\",IF(연간!$B$2=\"M\",\"SAT\"))","v":"FRI"},null,{"$f":"IF(연간!$B$2=\"S\",\"SAT\",IF(연간!$B$2=\"M\",\"SUN\"))","v":"SAT"}]
[null,{"$f":"IFERROR(INDEX(공휴일이름,MATCH(1,--($B$2=공휴일월)*(DAY(C7)=공휴일일),0)),\"\")","v":""},{"$f":"IF(연간!$B$2=\"M\",(IF(DAY(DATE($D$2,$B$2,1)-WEEKDAY(DATE($D$2,$B$2,1))+2)=2,DATE($D$2,$B$2,1)-WEEKDAY(DATE($D$2,$B$2,1))-5,DATE($D$2,$B$2,1)-WEEKDAY(DATE($D$2,$B$2,1))+2)),IF(연간!$B$2=\"S\",DATE($D$2,$B$2,1)-WEEKDAY(DATE($D$2,$B$2,1))+1))","v":"2022-05-01"},{"$f":"IFERROR(INDEX(공휴일이름,MATCH(1,--($B$2=공휴일월)*(DAY(E7)=공휴일일),0)),\"\")","v":""},{"$f":"C7+1","v":"2022-05-02"},{"$f":"IFERROR(INDEX(공휴일이름,MATCH(1,--($B$2=공휴일월)*(DAY(G7)=공휴일일),0)),\"\")","v":""},{"$f":"C7+2","v":"2022-05-03"},{"$f":"IFERROR(INDEX(공휴일이름,MATCH(1,--($B$2=공휴일월)*(DAY(I7)=공휴일일),0)),\"\")","v":""},{"$f":"C7+3","v":"2022-05-04"},{"$f":"IFERROR(INDEX(공휴일이름,MATCH(1,--($B$2=공휴일월)*(DAY(K7)=공휴일일),0)),\"\")","v":"어린이날"},{"$f":"C7+4","v":"2022-05-05"},{"$f":"IFERROR(INDEX(공휴일이름,MATCH(1,--($B$2=공휴일월)*(DAY(M7)=공휴일일),0)),\"\")","v":""},{"$f":"C7+5","v":"2022-05-06"},{"$f":"IFERROR(INDEX(공휴일이름,MATCH(1,--($B$2=공휴일월)*(DAY(O7)=공휴일일),0)),\"\")","v":""},{"$f":"C7+6","v":"2022-05-07"}]
[null,{"$f":"IF(MONTH(C7)<>$B$2,\"\",IF(VLOOKUP(C7,일정,2,0)=0,\"\",VLOOKUP(C7,일정,2,0)))","v":""},null,{"$f":"IF(MONTH(E7)<>$B$2,\"\",IF(VLOOKUP(E7,일정!$B$6:$L$371,2,0)=0,\"\",VLOOKUP(E7,일정!$B$6:$L$371,2,0)))","v":""},null,{"$f":"IF(MONTH(G7)<>$B$2,\"\",IF(VLOOKUP(G7,일정!$B$6:$L$371,2,0)=0,\"\",VLOOKUP(G7,일정!$B$6:$L$371,2,0)))","v":""},null,{"$f":"IF(MONTH(I7)<>$B$2,\"\",IF(VLOOKUP(I7,일정!$B$6:$L$371,2,0)=0,\"\",VLOOKUP(I7,일정!$B$6:$L$371,2,0)))","v":""},null,{"$f":"IF(MONTH(K7)<>$B$2,\"\",IF(VLOOKUP(K7,일정!$B$6:$L$371,2,0)=0,\"\",VLOOKUP(K7,일정!$B$6:$L$371,2,0)))","v":""},null,{"$f":"IF(MONTH(M7)<>$B$2,\"\",IF(VLOOKUP(M7,일정!$B$6:$L$371,2,0)=0,\"\",VLOOKUP(M7,일정!$B$6:$L$371,2,0)))","v":""},null,{"$f":"IF(MONTH(O7)<>$B$2,\"\",IF(VLOOKUP(O7,일정!$B$6:$L$371,2,0)=0,\"\",VLOOKUP(O7,일정!$B$6:$L$371,2,0)))","v":""},null,null,null,null,null,null,null,null,null,{"$f":"IF(MONTH(C7)<>$B$2,\"\",IF(VLOOKUP(C7,일정!$B$6:$L$371,3,0)=0,\"\",VLOOKUP(C7,일정!$B$6:$L$371,3,0)))","v":""},null,{"$f":"IF(MONTH(E7)<>$B$2,\"\",IF(VLOOKUP(E7,일정!$B$6:$L$371,3,0)=0,\"\",VLOOKUP(E7,일정!$B$6:$L$371,3,0)))","v":""},null,{"$f":"IF(MONTH(G7)<>$B$2,\"\",IF(VLOOKUP(G7,일정!$B$6:$L$371,3,0)=0,\"\",VLOOKUP(G7,일정!$B$6:$L$371,3,0)))","v":""},null,{"$f":"IF(MONTH(I7)<>$B$2,\"\",IF(VLOOKUP(I7,일정!$B$6:$L$371,3,0)=0,\"\",VLOOKUP(I7,일정!$B$6:$L$371,3,0)))","v":""},null,{"$f":"IF(MONTH(K7)<>$B$2,\"\",IF(VLOOKUP(K7,일정!$B$6:$L$371,3,0)=0,\"\",VLOOKUP(K7,일정!$B$6:$L$371,3,0)))","v":""},null,{"$f":"IF(MONTH(M7)<>$B$2,\"\",IF(VLOOKUP(M7,일정!$B$6:$L$371,3,0)=0,\"\",VLOOKUP(M7,일정!$B$6:$L$371,3,0)))","v":""},null,{"$f":"IF(MONTH(O7)<>$B$2,\"\",IF(VLOOKUP(O7,일정!$B$6:$L$371,3,0)=0,\"\",VLOOKUP(O7,일정!$B$6:$L$371,3,0)))","v":""}]
[null,{"$f":"IF(MONTH(C7)<>$B$2,\"\",IF(VLOOKUP(C7,일정!$B$6:$L$371,4,0)=0,\"\",VLOOKUP(C7,일정!$B$6:$L$371,4,0)))","v":""},null,{"$f":"IF(MONTH(E7)<>$B$2,\"\",IF(VLOOKUP(E7,일정!$B$6:$L$371,4,0)=0,\"\",VLOOKUP(E7,일정!$B$6:$L$371,4,0)))","v":""},null,{"$f":"IF(MONTH(G7)<>$B$2,\"\",IF(VLOOKUP(G7,일정!$B$6:$L$371,4,0)=0,\"\",VLOOKUP(G7,일정!$B$6:$L$371,4,0)))","v":""},null,{"$f":"IF(MONTH(I7)<>$B$2,\"\",IF(VLOOKUP(I7,일정!$B$6:$L$371,4,0)=0,\"\",VLOOKUP(I7,일정!$B$6:$L$371,4,0)))","v":""},null,{"$f":"IF(MONTH(K7)<>$B$2,\"\",IF(VLOOKUP(K7,일정!$B$6:$L$371,4,0)=0,\"\",VLOOKUP(K7,일정!$B$6:$L$371,4,0)))","v":""},null,{"$f":"IF(MONTH(M7)<>$B$2,\"\",IF(VLOOKUP(M7,일정!$B$6:$L$371,4,0)=0,\"\",VLOOKUP(M7,일정!$B$6:$L$371,4,0)))","v":""},null,{"$f":"IF(MONTH(O7)<>$B$2,\"\",IF(VLOOKUP(O7,일정!$B$6:$L$371,4,0)=0,\"\",VLOOKUP(O7,일정!$B$6:$L$371,4,0)))","v":""},null,null,null,null,null,null,null,null,null,{"$f":"IF(MONTH(C7)<>$B$2,\"\",IF(VLOOKUP(C7,일정!$B$6:$L$371,5,0)=0,\"\",VLOOKUP(C7,일정!$B$6:$L$371,5,0)))","v":""},null,{"$f":"IF(MONTH(E7)<>$B$2,\"\",IF(VLOOKUP(E7,일정!$B$6:$L$371,5,0)=0,\"\",VLOOKUP(E7,일정!$B$6:$L$371,5,0)))","v":""},null,{"$f":"IF(MONTH(G7)<>$B$2,\"\",IF(VLOOKUP(G7,일정!$B$6:$L$371,5,0)=0,\"\",VLOOKUP(G7,일정!$B$6:$L$371,5,0)))","v":""},null,{"$f":"IF(MONTH(I7)<>$B$2,\"\",IF(VLOOKUP(I7,일정!$B$6:$L$371,5,0)=0,\"\",VLOOKUP(I7,일정!$B$6:$L$371,5,0)))","v":""},null,{"$f":"IF(MONTH(K7)<>$B$2,\"\",IF(VLOOKUP(K7,일정!$B$6:$L$371,5,0)=0,\"\",VLOOKUP(K7,일정!$B$6:$L$371,5,0)))","v":""},null,{"$f":"IF(MONTH(M7)<>$B$2,\"\",IF(VLOOKUP(M7,일정!$B$6:$L$371,5,0)=0,\"\",VLOOKUP(M7,일정!$B$6:$L$371,5,0)))","v":""},null,{"$f":"IF(MONTH(O7)<>$B$2,\"\",IF(VLOOKUP(O7,일정!$B$6:$L$371,5,0)=0,\"\",VLOOKUP(O7,일정!$B$6:$L$371,5,0)))","v":""}]
[null,{"$f":"IF(MONTH(C7)<>$B$2,\"\",IF(VLOOKUP(C7,일정!$B$6:$L$371,6,0)=0,\"\",VLOOKUP(C7,일정!$B$6:$L$371,6,0)))","v":""},null,{"$f":"IF(MONTH(E7)<>$B$2,\"\",IF(VLOOKUP(E7,일정!$B$6:$L$371,6,0)=0,\"\",VLOOKUP(E7,일정!$B$6:$L$371,6,0)))","v":""},null,{"$f":"IF(MONTH(G7)<>$B$2,\"\",IF(VLOOKUP(G7,일정!$B$6:$L$371,6,0)=0,\"\",VLOOKUP(G7,일정!$B$6:$L$371,6,0)))","v":""},null,{"$f":"IF(MONTH(I7)<>$B$2,\"\",IF(VLOOKUP(I7,일정!$B$6:$L$371,6,0)=0,\"\",VLOOKUP(I7,일정!$B$6:$L$371,6,0)))","v":""},null,{"$f":"IF(MONTH(K7)<>$B$2,\"\",IF(VLOOKUP(K7,일정!$B$6:$L$371,6,0)=0,\"\",VLOOKUP(K7,일정!$B$6:$L$371,6,0)))","v":""},null,{"$f":"IF(MONTH(M7)<>$B$2,\"\",IF(VLOOKUP(M7,일정!$B$6:$L$371,6,0)=0,\"\",VLOOKUP(M7,일정!$B$6:$L$371,6,0)))","v":""},null,{"$f":"IF(MONTH(O7)<>$B$2,\"\",IF(VLOOKUP(O7,일정!$B$6:$L$371,6,0)=0,\"\",VLOOKUP(O7,일정!$B$6:$L$371,6,0)))","v":""},null,null,null,null,null,null,null,null,null,{"$f":"IF(MONTH(C7)<>$B$2,\"\",IF(VLOOKUP(C7,일정!$B$6:$L$371,7,0)=0,\"\",VLOOKUP(C7,일정!$B$6:$L$371,7,0)))","v":""},null,{"$f":"IF(MONTH(E7)<>$B$2,\"\",IF(VLOOKUP(E7,일정!$B$6:$L$371,7,0)=0,\"\",VLOOKUP(E7,일정!$B$6:$L$371,7,0)))","v":""},null,{"$f":"IF(MONTH(G7)<>$B$2,\"\",IF(VLOOKUP(G7,일정!$B$6:$L$371,7,0)=0,\"\",VLOOKUP(G7,일정!$B$6:$L$371,7,0)))","v":""},null,{"$f":"IF(MONTH(I7)<>$B$2,\"\",IF(VLOOKUP(I7,일정!$B$6:$L$371,7,0)=0,\"\",VLOOKUP(I7,일정!$B$6:$L$371,7,0)))","v":""},null,{"$f":"IF(MONTH(K7)<>$B$2,\"\",IF(VLOOKUP(K7,일정!$B$6:$L$371,7,0)=0,\"\",VLOOKUP(K7,일정!$B$6:$L$371,7,0)))","v":""},null,{"$f":"IF(MONTH(M7)<>$B$2,\"\",IF(VLOOKUP(M7,일정!$B$6:$L$371,7,0)=0,\"\",VLOOKUP(M7,일정!$B$6:$L$371,7,0)))","v":""},null,{"$f":"IF(MONTH(O7)<>$B$2,\"\",IF(VLOOKUP(O7,일정!$B$6:$L$371,7,0)=0,\"\",VLOOKUP(O7,일정!$B$6:$L$371,7,0)))","v":""}]
[null,{"$f":"IF(MONTH(C7)<>$B$2,\"\",IF(VLOOKUP(C7,일정!$B$6:$L$371,8,0)=0,\"\",VLOOKUP(C7,일정!$B$6:$L$371,8,0)))","v":""},null,{"$f":"IF(MONTH(E7)<>$B$2,\"\",IF(VLOOKUP(E7,일정!$B$6:$L$371,8,0)=0,\"\",VLOOKUP(E7,일정!$B$6:$L$371,8,0)))","v":""},null,{"$f":"IF(MONTH(G7)<>$B$2,\"\",IF(VLOOKUP(G7,일정!$B$6:$L$371,8,0)=0,\"\",VLOOKUP(G7,일정!$B$6:$L$371,8,0)))","v":""},null,{"$f":"IF(MONTH(I7)<>$B$2,\"\",IF(VLOOKUP(I7,일정!$B$6:$L$371,8,0)=0,\"\",VLOOKUP(I7,일정!$B$6:$L$371,8,0)))","v":""},null,{"$f":"IF(MONTH(K7)<>$B$2,\"\",IF(VLOOKUP(K7,일정!$B$6:$L$371,8,0)=0,\"\",VLOOKUP(K7,일정!$B$6:$L$371,8,0)))","v":""},null,{"$f":"IF(MONTH(M7)<>$B$2,\"\",IF(VLOOKUP(M7,일정!$B$6:$L$371,8,0)=0,\"\",VLOOKUP(M7,일정!$B$6:$L$371,8,0)))","v":""},null,{"$f":"IF(MONTH(O7)<>$B$2,\"\",IF(VLOOKUP(O7,일정!$B$6:$L$371,8,0)=0,\"\",VLOOKUP(O7,일정!$B$6:$L$371,8,0)))","v":""},null,null,null,null,null,null,null,null,null,{"$f":"IF(MONTH(C7)<>$B$2,\"\",IF(VLOOKUP(C7,일정!$B$6:$L$371,9,0)=0,\"\",VLOOKUP(C7,일정!$B$6:$L$371,9,0)))","v":""},null,{"$f":"IF(MONTH(E7)<>$B$2,\"\",IF(VLOOKUP(E7,일정!$B$6:$L$371,9,0)=0,\"\",VLOOKUP(E7,일정!$B$6:$L$371,9,0)))","v":""},null,{"$f":"IF(MONTH(G7)<>$B$2,\"\",IF(VLOOKUP(G7,일정!$B$6:$L$371,9,0)=0,\"\",VLOOKUP(G7,일정!$B$6:$L$371,9,0)))","v":""},null,{"$f":"IF(MONTH(I7)<>$B$2,\"\",IF(VLOOKUP(I7,일정!$B$6:$L$371,9,0)=0,\"\",VLOOKUP(I7,일정!$B$6:$L$371,9,0)))","v":""},null,{"$f":"IF(MONTH(K7)<>$B$2,\"\",IF(VLOOKUP(K7,일정!$B$6:$L$371,9,0)=0,\"\",VLOOKUP(K7,일정!$B$6:$L$371,9,0)))","v":""},null,{"$f":"IF(MONTH(M7)<>$B$2,\"\",IF(VLOOKUP(M7,일정!$B$6:$L$371,9,0)=0,\"\",VLOOKUP(M7,일정!$B$6:$L$371,9,0)))","v":""},null,{"$f":"IF(MONTH(O7)<>$B$2,\"\",IF(VLOOKUP(O7,일정!$B$6:$L$371,9,0)=0,\"\",VLOOKUP(O7,일정!$B$6:$L$371,9,0)))","v":""}]
[null,{"$f":"IF(MONTH(C7)<>$B$2,\"\",IF(VLOOKUP(C7,일정!$B$6:$L$371,10,0)=0,\"\",VLOOKUP(C7,일정!$B$6:$L$371,10,0)))","v":""},null,{"$f":"IF(MONTH(E7)<>$B$2,\"\",IF(VLOOKUP(E7,일정!$B$6:$L$371,10,0)=0,\"\",VLOOKUP(E7,일정!$B$6:$L$371,10,0)))","v":""},null,{"$f":"IF(MONTH(G7)<>$B$2,\"\",IF(VLOOKUP(G7,일정!$B$6:$L$371,10,0)=0,\"\",VLOOKUP(G7,일정!$B$6:$L$371,10,0)))","v":""},null,{"$f":"IF(MONTH(I7)<>$B$2,\"\",IF(VLOOKUP(I7,일정!$B$6:$L$371,10,0)=0,\"\",VLOOKUP(I7,일정!$B$6:$L$371,10,0)))","v":""},null,{"$f":"IF(MONTH(K7)<>$B$2,\"\",IF(VLOOKUP(K7,일정!$B$6:$L$371,10,0)=0,\"\",VLOOKUP(K7,일정!$B$6:$L$371,10,0)))","v":""},null,{"$f":"IF(MONTH(M7)<>$B$2,\"\",IF(VLOOKUP(M7,일정!$B$6:$L$371,10,0)=0,\"\",VLOOKUP(M7,일정!$B$6:$L$371,10,0)))","v":""},null,{"$f":"IF(MONTH(O7)<>$B$2,\"\",IF(VLOOKUP(O7,일정!$B$6:$L$371,10,0)=0,\"\",VLOOKUP(O7,일정!$B$6:$L$371,10,0)))","v":""},null,null,null,null,null,null,null,null,null,{"$f":"IF(MONTH(C7)<>$B$2,\"\",IF(VLOOKUP(C7,일정!$B$6:$L$371,11,0)=0,\"\",VLOOKUP(C7,일정!$B$6:$L$371,11,0)))","v":""},null,{"$f":"IF(MONTH(E7)<>$B$2,\"\",IF(VLOOKUP(E7,일정!$B$6:$L$371,11,0)=0,\"\",VLOOKUP(E7,일정!$B$6:$L$371,11,0)))","v":""},null,{"$f":"IF(MONTH(G7)<>$B$2,\"\",IF(VLOOKUP(G7,일정!$B$6:$L$371,11,0)=0,\"\",VLOOKUP(G7,일정!$B$6:$L$371,11,0)))","v":""},null,{"$f":"IF(MONTH(I7)<>$B$2,\"\",IF(VLOOKUP(I7,일정!$B$6:$L$371,11,0)=0,\"\",VLOOKUP(I7,일정!$B$6:$L$371,11,0)))","v":""},null,{"$f":"IF(MONTH(K7)<>$B$2,\"\",IF(VLOOKUP(K7,일정!$B$6:$L$371,11,0)=0,\"\",VLOOKUP(K7,일정!$B$6:$L$371,11,0)))","v":""},null,{"$f":"IF(MONTH(M7)<>$B$2,\"\",IF(VLOOKUP(M7,일정!$B$6:$L$371,11,0)=0,\"\",VLOOKUP(M7,일정!$B$6:$L$371,11,0)))","v":""},null,{"$f":"IF(MONTH(O7)<>$B$2,\"\",IF(VLOOKUP(O7,일정!$B$6:$L$371,11,0)=0,\"\",VLOOKUP(O7,일정!$B$6:$L$371,11,0)))","v":""}]
[null,{"$f":"IFERROR(INDEX(공휴일이름,MATCH(1,--($B$2=공휴일월)*(DAY(C13)=공휴일일),0)),\"\")","v":"석가탄신일"},{"$f":"C7+7","v":"2022-05-08"},{"$f":"IFERROR(INDEX(공휴일이름,MATCH(1,--($B$2=공휴일월)*(DAY(E13)=공휴일일),0)),\"\")","v":""},{"$f":"C7+8","v":"2022-05-09"},{"$f":"IFERROR(INDEX(공휴일이름,MATCH(1,--($B$2=공휴일월)*(DAY(G13)=공휴일일),0)),\"\")","v":""},{"$f":"C7+9","v":"2022-05-10"},{"$f":"IFERROR(INDEX(공휴일이름,MATCH(1,--($B$2=공휴일월)*(DAY(I13)=공휴일일),0)),\"\")","v":""},{"$f":"C7+10","v":"2022-05-11"},{"$f":"IFERROR(INDEX(공휴일이름,MATCH(1,--($B$2=공휴일월)*(DAY(K13)=공휴일일),0)),\"\")","v":""},{"$f":"C7+11","v":"2022-05-12"},{"$f":"IFERROR(INDEX(공휴일이름,MATCH(1,--($B$2=공휴일월)*(DAY(M13)=공휴일일),0)),\"\")","v":""},{"$f":"C7+12","v":"2022-05-13"},{"$f":"IFERROR(INDEX(공휴일이름,MATCH(1,--($B$2=공휴일월)*(DAY(O13)=공휴일일),0)),\"\")","v":""},{"$f":"C7+13","v":"2022-05-14"}]
[null,{"$f":"IF(MONTH(C13)<>$B$2,\"\",IF(VLOOKUP(C13,일정,2,0)=0,\"\",VLOOKUP(C13,일정,2,0)))","v":""},null,{"$f":"IF(MONTH(E13)<>$B$2,\"\",IF(VLOOKUP(E13,일정!$B$6:$L$371,2,0)=0,\"\",VLOOKUP(E13,일정!$B$6:$L$371,2,0)))","v":""},null,{"$f":"IF(MONTH(G13)<>$B$2,\"\",IF(VLOOKUP(G13,일정!$B$6:$L$371,2,0)=0,\"\",VLOOKUP(G13,일정!$B$6:$L$371,2,0)))","v":""},null,{"$f":"IF(MONTH(I13)<>$B$2,\"\",IF(VLOOKUP(I13,일정!$B$6:$L$371,2,0)=0,\"\",VLOOKUP(I13,일정!$B$6:$L$371,2,0)))","v":""},null,{"$f":"IF(MONTH(K13)<>$B$2,\"\",IF(VLOOKUP(K13,일정!$B$6:$L$371,2,0)=0,\"\",VLOOKUP(K13,일정!$B$6:$L$371,2,0)))","v":""},null,{"$f":"IF(MONTH(M13)<>$B$2,\"\",IF(VLOOKUP(M13,일정!$B$6:$L$371,2,0)=0,\"\",VLOOKUP(M13,일정!$B$6:$L$371,2,0)))","v":""},null,{"$f":"IF(MONTH(O13)<>$B$2,\"\",IF(VLOOKUP(O13,일정!$B$6:$L$371,2,0)=0,\"\",VLOOKUP(O13,일정!$B$6:$L$371,2,0)))","v":""},null,null,null,null,null,null,null,null,null,{"$f":"IF(MONTH(C13)<>$B$2,\"\",IF(VLOOKUP(C13,일정!$B$6:$L$371,3,0)=0,\"\",VLOOKUP(C13,일정!$B$6:$L$371,3,0)))","v":""},null,{"$f":"IF(MONTH(E13)<>$B$2,\"\",IF(VLOOKUP(E13,일정!$B$6:$L$371,3,0)=0,\"\",VLOOKUP(E13,일정!$B$6:$L$371,3,0)))","v":""},null,{"$f":"IF(MONTH(G13)<>$B$2,\"\",IF(VLOOKUP(G13,일정!$B$6:$L$371,3,0)=0,\"\",VLOOKUP(G13,일정!$B$6:$L$371,3,0)))","v":""},null,{"$f":"IF(MONTH(I13)<>$B$2,\"\",IF(VLOOKUP(I13,일정!$B$6:$L$371,3,0)=0,\"\",VLOOKUP(I13,일정!$B$6:$L$371,3,0)))","v":""},null,{"$f":"IF(MONTH(K13)<>$B$2,\"\",IF(VLOOKUP(K13,일정!$B$6:$L$371,3,0)=0,\"\",VLOOKUP(K13,일정!$B$6:$L$371,3,0)))","v":""},null,{"$f":"IF(MONTH(M13)<>$B$2,\"\",IF(VLOOKUP(M13,일정!$B$6:$L$371,3,0)=0,\"\",VLOOKUP(M13,일정!$B$6:$L$371,3,0)))","v":""},null,{"$f":"IF(MONTH(O13)<>$B$2,\"\",IF(VLOOKUP(O13,일정!$B$6:$L$371,3,0)=0,\"\",VLOOKUP(O13,일정!$B$6:$L$371,3,0)))","v":""}]
[null,{"$f":"IF(MONTH(C13)<>$B$2,\"\",IF(VLOOKUP(C13,일정!$B$6:$L$371,4,0)=0,\"\",VLOOKUP(C13,일정!$B$6:$L$371,4,0)))","v":""},null,{"$f":"IF(MONTH(E13)<>$B$2,\"\",IF(VLOOKUP(E13,일정!$B$6:$L$371,4,0)=0,\"\",VLOOKUP(E13,일정!$B$6:$L$371,4,0)))","v":""},null,{"$f":"IF(MONTH(G13)<>$B$2,\"\",IF(VLOOKUP(G13,일정!$B$6:$L$371,4,0)=0,\"\",VLOOKUP(G13,일정!$B$6:$L$371,4,0)))","v":""},null,{"$f":"IF(MONTH(I13)<>$B$2,\"\",IF(VLOOKUP(I13,일정!$B$6:$L$371,4,0)=0,\"\",VLOOKUP(I13,일정!$B$6:$L$371,4,0)))","v":""},null,{"$f":"IF(MONTH(K13)<>$B$2,\"\",IF(VLOOKUP(K13,일정!$B$6:$L$371,4,0)=0,\"\",VLOOKUP(K13,일정!$B$6:$L$371,4,0)))","v":""},null,{"$f":"IF(MONTH(M13)<>$B$2,\"\",IF(VLOOKUP(M13,일정!$B$6:$L$371,4,0)=0,\"\",VLOOKUP(M13,일정!$B$6:$L$371,4,0)))","v":""},null,{"$f":"IF(MONTH(O13)<>$B$2,\"\",IF(VLOOKUP(O13,일정!$B$6:$L$371,4,0)=0,\"\",VLOOKUP(O13,일정!$B$6:$L$371,4,0)))","v":""},null,null,null,null,null,null,null,null,null,{"$f":"IF(MONTH(C13)<>$B$2,\"\",IF(VLOOKUP(C13,일정!$B$6:$L$371,5,0)=0,\"\",VLOOKUP(C13,일정!$B$6:$L$371,5,0)))","v":""},null,{"$f":"IF(MONTH(E13)<>$B$2,\"\",IF(VLOOKUP(E13,일정!$B$6:$L$371,5,0)=0,\"\",VLOOKUP(E13,일정!$B$6:$L$371,5,0)))","v":""},null,{"$f":"IF(MONTH(G13)<>$B$2,\"\",IF(VLOOKUP(G13,일정!$B$6:$L$371,5,0)=0,\"\",VLOOKUP(G13,일정!$B$6:$L$371,5,0)))","v":""},null,{"$f":"IF(MONTH(I13)<>$B$2,\"\",IF(VLOOKUP(I13,일정!$B$6:$L$371,5,0)=0,\"\",VLOOKUP(I13,일정!$B$6:$L$371,5,0)))","v":""},null,{"$f":"IF(MONTH(K13)<>$B$2,\"\",IF(VLOOKUP(K13,일정!$B$6:$L$371,5,0)=0,\"\",VLOOKUP(K13,일정!$B$6:$L$371,5,0)))","v":""},null,{"$f":"IF(MONTH(M13)<>$B$2,\"\",IF(VLOOKUP(M13,일정!$B$6:$L$371,5,0)=0,\"\",VLOOKUP(M13,일정!$B$6:$L$371,5,0)))","v":""},null,{"$f":"IF(MONTH(O13)<>$B$2,\"\",IF(VLOOKUP(O13,일정!$B$6:$L$371,5,0)=0,\"\",VLOOKUP(O13,일정!$B$6:$L$371,5,0)))","v":""}]
[null,{"$f":"IF(MONTH(C13)<>$B$2,\"\",IF(VLOOKUP(C13,일정!$B$6:$L$371,6,0)=0,\"\",VLOOKUP(C13,일정!$B$6:$L$371,6,0)))","v":""},null,{"$f":"IF(MONTH(E13)<>$B$2,\"\",IF(VLOOKUP(E13,일정!$B$6:$L$371,6,0)=0,\"\",VLOOKUP(E13,일정!$B$6:$L$371,6,0)))","v":""},null,{"$f":"IF(MONTH(G13)<>$B$2,\"\",IF(VLOOKUP(G13,일정!$B$6:$L$371,6,0)=0,\"\",VLOOKUP(G13,일정!$B$6:$L$371,6,0)))","v":""},null,{"$f":"IF(MONTH(I13)<>$B$2,\"\",IF(VLOOKUP(I13,일정!$B$6:$L$371,6,0)=0,\"\",VLOOKUP(I13,일정!$B$6:$L$371,6,0)))","v":""},null,{"$f":"IF(MONTH(K13)<>$B$2,\"\",IF(VLOOKUP(K13,일정!$B$6:$L$371,6,0)=0,\"\",VLOOKUP(K13,일정!$B$6:$L$371,6,0)))","v":""},null,{"$f":"IF(MONTH(M13)<>$B$2,\"\",IF(VLOOKUP(M13,일정!$B$6:$L$371,6,0)=0,\"\",VLOOKUP(M13,일정!$B$6:$L$371,6,0)))","v":""},null,{"$f":"IF(MONTH(O13)<>$B$2,\"\",IF(VLOOKUP(O13,일정!$B$6:$L$371,6,0)=0,\"\",VLOOKUP(O13,일정!$B$6:$L$371,6,0)))","v":""},null,null,null,null,null,null,null,null,null,{"$f":"IF(MONTH(C13)<>$B$2,\"\",IF(VLOOKUP(C13,일정!$B$6:$L$371,7,0)=0,\"\",VLOOKUP(C13,일정!$B$6:$L$371,7,0)))","v":""},null,{"$f":"IF(MONTH(E13)<>$B$2,\"\",IF(VLOOKUP(E13,일정!$B$6:$L$371,7,0)=0,\"\",VLOOKUP(E13,일정!$B$6:$L$371,7,0)))","v":""},null,{"$f":"IF(MONTH(G13)<>$B$2,\"\",IF(VLOOKUP(G13,일정!$B$6:$L$371,7,0)=0,\"\",VLOOKUP(G13,일정!$B$6:$L$371,7,0)))","v":""},null,{"$f":"IF(MONTH(I13)<>$B$2,\"\",IF(VLOOKUP(I13,일정!$B$6:$L$371,7,0)=0,\"\",VLOOKUP(I13,일정!$B$6:$L$371,7,0)))","v":""},null,{"$f":"IF(MONTH(K13)<>$B$2,\"\",IF(VLOOKUP(K13,일정!$B$6:$L$371,7,0)=0,\"\",VLOOKUP(K13,일정!$B$6:$L$371,7,0)))","v":""},null,{"$f":"IF(MONTH(M13)<>$B$2,\"\",IF(VLOOKUP(M13,일정!$B$6:$L$371,7,0)=0,\"\",VLOOKUP(M13,일정!$B$6:$L$371,7,0)))","v":""},null,{"$f":"IF(MONTH(O13)<>$B$2,\"\",IF(VLOOKUP(O13,일정!$B$6:$L$371,7,0)=0,\"\",VLOOKUP(O13,일정!$B$6:$L$371,7,0)))","v":""}]
[null,{"$f":"IF(MONTH(C13)<>$B$2,\"\",IF(VLOOKUP(C13,일정!$B$6:$L$371,8,0)=0,\"\",VLOOKUP(C13,일정!$B$6:$L$371,8,0)))","v":""},null,{"$f":"IF(MONTH(E13)<>$B$2,\"\",IF(VLOOKUP(E13,일정!$B$6:$L$371,8,0)=0,\"\",VLOOKUP(E13,일정!$B$6:$L$371,8,0)))","v":""},null,{"$f":"IF(MONTH(G13)<>$B$2,\"\",IF(VLOOKUP(G13,일정!$B$6:$L$371,8,0)=0,\"\",VLOOKUP(G13,일정!$B$6:$L$371,8,0)))","v":""},null,{"$f":"IF(MONTH(I13)<>$B$2,\"\",IF(VLOOKUP(I13,일정!$B$6:$L$371,8,0)=0,\"\",VLOOKUP(I13,일정!$B$6:$L$371,8,0)))","v":""},null,{"$f":"IF(MONTH(K13)<>$B$2,\"\",IF(VLOOKUP(K13,일정!$B$6:$L$371,8,0)=0,\"\",VLOOKUP(K13,일정!$B$6:$L$371,8,0)))","v":""},null,{"$f":"IF(MONTH(M13)<>$B$2,\"\",IF(VLOOKUP(M13,일정!$B$6:$L$371,8,0)=0,\"\",VLOOKUP(M13,일정!$B$6:$L$371,8,0)))","v":""},null,{"$f":"IF(MONTH(O13)<>$B$2,\"\",IF(VLOOKUP(O13,일정!$B$6:$L$371,8,0)=0,\"\",VLOOKUP(O13,일정!$B$6:$L$371,8,0)))","v":""},null,null,null,null,null,null,null,null,null,{"$f":"IF(MONTH(C13)<>$B$2,\"\",IF(VLOOKUP(C13,일정!$B$6:$L$371,9,0)=0,\"\",VLOOKUP(C13,일정!$B$6:$L$371,9,0)))","v":""},null,{"$f":"IF(MONTH(E13)<>$B$2,\"\",IF(VLOOKUP(E13,일정!$B$6:$L$371,9,0)=0,\"\",VLOOKUP(E13,일정!$B$6:$L$371,9,0)))","v":""},null,{"$f":"IF(MONTH(G13)<>$B$2,\"\",IF(VLOOKUP(G13,일정!$B$6:$L$371,9,0)=0,\"\",VLOOKUP(G13,일정!$B$6:$L$371,9,0)))","v":""},null,{"$f":"IF(MONTH(I13)<>$B$2,\"\",IF(VLOOKUP(I13,일정!$B$6:$L$371,9,0)=0,\"\",VLOOKUP(I13,일정!$B$6:$L$371,9,0)))","v":""},null,{"$f":"IF(MONTH(K13)<>$B$2,\"\",IF(VLOOKUP(K13,일정!$B$6:$L$371,9,0)=0,\"\",VLOOKUP(K13,일정!$B$6:$L$371,9,0)))","v":""},null,{"$f":"IF(MONTH(M13)<>$B$2,\"\",IF(VLOOKUP(M13,일정!$B$6:$L$371,9,0)=0,\"\",VLOOKUP(M13,일정!$B$6:$L$371,9,0)))","v":""},null,{"$f":"IF(MONTH(O13)<>$B$2,\"\",IF(VLOOKUP(O13,일정!$B$6:$L$371,9,0)=0,\"\",VLOOKUP(O13,일정!$B$6:$L$371,9,0)))","v":""}]
[null,{"$f":"IF(MONTH(C13)<>$B$2,\"\",IF(VLOOKUP(C13,일정!$B$6:$L$371,10,0)=0,\"\",VLOOKUP(C13,일정!$B$6:$L$371,10,0)))","v":""},null,{"$f":"IF(MONTH(E13)<>$B$2,\"\",IF(VLOOKUP(E13,일정!$B$6:$L$371,10,0)=0,\"\",VLOOKUP(E13,일정!$B$6:$L$371,10,0)))","v":""},null,{"$f":"IF(MONTH(G13)<>$B$2,\"\",IF(VLOOKUP(G13,일정!$B$6:$L$371,10,0)=0,\"\",VLOOKUP(G13,일정!$B$6:$L$371,10,0)))","v":""},null,{"$f":"IF(MONTH(I13)<>$B$2,\"\",IF(VLOOKUP(I13,일정!$B$6:$L$371,10,0)=0,\"\",VLOOKUP(I13,일정!$B$6:$L$371,10,0)))","v":""},null,{"$f":"IF(MONTH(K13)<>$B$2,\"\",IF(VLOOKUP(K13,일정!$B$6:$L$371,10,0)=0,\"\",VLOOKUP(K13,일정!$B$6:$L$371,10,0)))","v":""},null,{"$f":"IF(MONTH(M13)<>$B$2,\"\",IF(VLOOKUP(M13,일정!$B$6:$L$371,10,0)=0,\"\",VLOOKUP(M13,일정!$B$6:$L$371,10,0)))","v":""},null,{"$f":"IF(MONTH(O13)<>$B$2,\"\",IF(VLOOKUP(O13,일정!$B$6:$L$371,10,0)=0,\"\",VLOOKUP(O13,일정!$B$6:$L$371,10,0)))","v":""},null,null,null,null,null,null,null,null,null,{"$f":"IF(MONTH(C13)<>$B$2,\"\",IF(VLOOKUP(C13,일정!$B$6:$L$371,11,0)=0,\"\",VLOOKUP(C13,일정!$B$6:$L$371,11,0)))","v":""},null,{"$f":"IF(MONTH(E13)<>$B$2,\"\",IF(VLOOKUP(E13,일정!$B$6:$L$371,11,0)=0,\"\",VLOOKUP(E13,일정!$B$6:$L$371,11,0)))","v":""},null,{"$f":"IF(MONTH(G13)<>$B$2,\"\",IF(VLOOKUP(G13,일정!$B$6:$L$371,11,0)=0,\"\",VLOOKUP(G13,일정!$B$6:$L$371,11,0)))","v":""},null,{"$f":"IF(MONTH(I13)<>$B$2,\"\",IF(VLOOKUP(I13,일정!$B$6:$L$371,11,0)=0,\"\",VLOOKUP(I13,일정!$B$6:$L$371,11,0)))","v":""},null,{"$f":"IF(MONTH(K13)<>$B$2,\"\",IF(VLOOKUP(K13,일정!$B$6:$L$371,11,0)=0,\"\",VLOOKUP(K13,일정!$B$6:$L$371,11,0)))","v":""},null,{"$f":"IF(MONTH(M13)<>$B$2,\"\",IF(VLOOKUP(M13,일정!$B$6:$L$371,11,0)=0,\"\",VLOOKUP(M13,일정!$B$6:$L$371,11,0)))","v":""},null,{"$f":"IF(MONTH(O13)<>$B$2,\"\",IF(VLOOKUP(O13,일정!$B$6:$L$371,11,0)=0,\"\",VLOOKUP(O13,일정!$B$6:$L$371,11,0)))","v":""}]
[null,{"$f":"IFERROR(INDEX(공휴일이름,MATCH(1,--($B$2=공휴일월)*(DAY(C19)=공휴일일),0)),\"\")","v":""},{"$f":"C7+14","v":"2022-05-15"},{"$f":"IFERROR(INDEX(공휴일이름,MATCH(1,--($B$2=공휴일월)*(DAY(E19)=공휴일일),0)),\"\")","v":""},{"$f":"C7+15","v":"2022-05-16"},{"$f":"IFERROR(INDEX(공휴일이름,MATCH(1,--($B$2=공휴일월)*(DAY(G19)=공휴일일),0)),\"\")","v":""},{"$f":"C7+16","v":"2022-05-17"},{"$f":"IFERROR(INDEX(공휴일이름,MATCH(1,--($B$2=공휴일월)*(DAY(I19)=공휴일일),0)),\"\")","v":""},{"$f":"C7+17","v":"2022-05-18"},{"$f":"IFERROR(INDEX(공휴일이름,MATCH(1,--($B$2=공휴일월)*(DAY(K19)=공휴일일),0)),\"\")","v":""},{"$f":"C7+18","v":"2022-05-19"},{"$f":"IFERROR(INDEX(공휴일이름,MATCH(1,--($B$2=공휴일월)*(DAY(M19)=공휴일일),0)),\"\")","v":""},{"$f":"C7+19","v":"2022-05-20"},{"$f":"IFERROR(INDEX(공휴일이름,MATCH(1,--($B$2=공휴일월)*(DAY(O19)=공휴일일),0)),\"\")","v":""},{"$f":"C7+20","v":"2022-05-21"}]
[null,{"$f":"IF(MONTH(C19)<>$B$2,\"\",IF(VLOOKUP(C19,일정!$B$6:$L$371,2,0)=0,\"\",VLOOKUP(C19,일정!$B$6:$L$371,2,0)))","v":""},null,{"$f":"IF(MONTH(E19)<>$B$2,\"\",IF(VLOOKUP(E19,일정!$B$6:$L$371,2,0)=0,\"\",VLOOKUP(E19,일정!$B$6:$L$371,2,0)))","v":""},null,{"$f":"IF(MONTH(G19)<>$B$2,\"\",IF(VLOOKUP(G19,일정!$B$6:$L$371,2,0)=0,\"\",VLOOKUP(G19,일정!$B$6:$L$371,2,0)))","v":""},null,{"$f":"IF(MONTH(I19)<>$B$2,\"\",IF(VLOOKUP(I19,일정!$B$6:$L$371,2,0)=0,\"\",VLOOKUP(I19,일정!$B$6:$L$371,2,0)))","v":""},null,{"$f":"IF(MONTH(K19)<>$B$2,\"\",IF(VLOOKUP(K19,일정!$B$6:$L$371,2,0)=0,\"\",VLOOKUP(K19,일정!$B$6:$L$371,2,0)))","v":""},null,{"$f":"IF(MONTH(M19)<>$B$2,\"\",IF(VLOOKUP(M19,일정!$B$6:$L$371,2,0)=0,\"\",VLOOKUP(M19,일정!$B$6:$L$371,2,0)))","v":""},null,{"$f":"IF(MONTH(O19)<>$B$2,\"\",IF(VLOOKUP(O19,일정!$B$6:$L$371,2,0)=0,\"\",VLOOKUP(O19,일정!$B$6:$L$371,2,0)))","v":""},null,null,null,null,null,null,null,null,null,{"$f":"IF(MONTH(C19)<>$B$2,\"\",IF(VLOOKUP(C19,일정!$B$6:$L$371,3,0)=0,\"\",VLOOKUP(C19,일정!$B$6:$L$371,3,0)))","v":""},null,{"$f":"IF(MONTH(E19)<>$B$2,\"\",IF(VLOOKUP(E19,일정!$B$6:$L$371,3,0)=0,\"\",VLOOKUP(E19,일정!$B$6:$L$371,3,0)))","v":""},null,{"$f":"IF(MONTH(G19)<>$B$2,\"\",IF(VLOOKUP(G19,일정!$B$6:$L$371,3,0)=0,\"\",VLOOKUP(G19,일정!$B$6:$L$371,3,0)))","v":""},null,{"$f":"IF(MONTH(I19)<>$B$2,\"\",IF(VLOOKUP(I19,일정!$B$6:$L$371,3,0)=0,\"\",VLOOKUP(I19,일정!$B$6:$L$371,3,0)))","v":""},null,{"$f":"IF(MONTH(K19)<>$B$2,\"\",IF(VLOOKUP(K19,일정!$B$6:$L$371,3,0)=0,\"\",VLOOKUP(K19,일정!$B$6:$L$371,3,0)))","v":""},null,{"$f":"IF(MONTH(M19)<>$B$2,\"\",IF(VLOOKUP(M19,일정!$B$6:$L$371,3,0)=0,\"\",VLOOKUP(M19,일정!$B$6:$L$371,3,0)))","v":""},null,{"$f":"IF(MONTH(O19)<>$B$2,\"\",IF(VLOOKUP(O19,일정!$B$6:$L$371,3,0)=0,\"\",VLOOKUP(O19,일정!$B$6:$L$371,3,0)))","v":""}]
[null,{"$f":"IF(MONTH(C19)<>$B$2,\"\",IF(VLOOKUP(C19,일정!$B$6:$L$371,4,0)=0,\"\",VLOOKUP(C19,일정!$B$6:$L$371,4,0)))","v":""},null,{"$f":"IF(MONTH(E19)<>$B$2,\"\",IF(VLOOKUP(E19,일정!$B$6:$L$371,4,0)=0,\"\",VLOOKUP(E19,일정!$B$6:$L$371,4,0)))","v":""},null,{"$f":"IF(MONTH(G19)<>$B$2,\"\",IF(VLOOKUP(G19,일정!$B$6:$L$371,4,0)=0,\"\",VLOOKUP(G19,일정!$B$6:$L$371,4,0)))","v":""},null,{"$f":"IF(MONTH(I19)<>$B$2,\"\",IF(VLOOKUP(I19,일정!$B$6:$L$371,4,0)=0,\"\",VLOOKUP(I19,일정!$B$6:$L$371,4,0)))","v":""},null,{"$f":"IF(MONTH(K19)<>$B$2,\"\",IF(VLOOKUP(K19,일정!$B$6:$L$371,4,0)=0,\"\",VLOOKUP(K19,일정!$B$6:$L$371,4,0)))","v":""},null,{"$f":"IF(MONTH(M19)<>$B$2,\"\",IF(VLOOKUP(M19,일정!$B$6:$L$371,4,0)=0,\"\",VLOOKUP(M19,일정!$B$6:$L$371,4,0)))","v":""},null,{"$f":"IF(MONTH(O19)<>$B$2,\"\",IF(VLOOKUP(O19,일정!$B$6:$L$371,4,0)=0,\"\",VLOOKUP(O19,일정!$B$6:$L$371,4,0)))","v":""},null,null,null,null,null,null,null,null,null,{"$f":"IF(MONTH(C19)<>$B$2,\"\",IF(VLOOKUP(C19,일정!$B$6:$L$371,5,0)=0,\"\",VLOOKUP(C19,일정!$B$6:$L$371,5,0)))","v":""},null,{"$f":"IF(MONTH(E19)<>$B$2,\"\",IF(VLOOKUP(E19,일정!$B$6:$L$371,5,0)=0,\"\",VLOOKUP(E19,일정!$B$6:$L$371,5,0)))","v":""},null,{"$f":"IF(MONTH(G19)<>$B$2,\"\",IF(VLOOKUP(G19,일정!$B$6:$L$371,5,0)=0,\"\",VLOOKUP(G19,일정!$B$6:$L$371,5,0)))","v":""},null,{"$f":"IF(MONTH(I19)<>$B$2,\"\",IF(VLOOKUP(I19,일정!$B$6:$L$371,5,0)=0,\"\",VLOOKUP(I19,일정!$B$6:$L$371,5,0)))","v":""},null,{"$f":"IF(MONTH(K19)<>$B$2,\"\",IF(VLOOKUP(K19,일정!$B$6:$L$371,5,0)=0,\"\",VLOOKUP(K19,일정!$B$6:$L$371,5,0)))","v":""},null,{"$f":"IF(MONTH(M19)<>$B$2,\"\",IF(VLOOKUP(M19,일정!$B$6:$L$371,5,0)=0,\"\",VLOOKUP(M19,일정!$B$6:$L$371,5,0)))","v":""},null,{"$f":"IF(MONTH(O19)<>$B$2,\"\",IF(VLOOKUP(O19,일정!$B$6:$L$371,5,0)=0,\"\",VLOOKUP(O19,일정!$B$6:$L$371,5,0)))","v":""}]
[null,{"$f":"IF(MONTH(C19)<>$B$2,\"\",IF(VLOOKUP(C19,일정!$B$6:$L$371,6,0)=0,\"\",VLOOKUP(C19,일정!$B$6:$L$371,6,0)))","v":""},null,{"$f":"IF(MONTH(E19)<>$B$2,\"\",IF(VLOOKUP(E19,일정!$B$6:$L$371,6,0)=0,\"\",VLOOKUP(E19,일정!$B$6:$L$371,6,0)))","v":""},null,{"$f":"IF(MONTH(G19)<>$B$2,\"\",IF(VLOOKUP(G19,일정!$B$6:$L$371,6,0)=0,\"\",VLOOKUP(G19,일정!$B$6:$L$371,6,0)))","v":""},null,{"$f":"IF(MONTH(I19)<>$B$2,\"\",IF(VLOOKUP(I19,일정!$B$6:$L$371,6,0)=0,\"\",VLOOKUP(I19,일정!$B$6:$L$371,6,0)))","v":""},null,{"$f":"IF(MONTH(K19)<>$B$2,\"\",IF(VLOOKUP(K19,일정!$B$6:$L$371,6,0)=0,\"\",VLOOKUP(K19,일정!$B$6:$L$371,6,0)))","v":""},null,{"$f":"IF(MONTH(M19)<>$B$2,\"\",IF(VLOOKUP(M19,일정!$B$6:$L$371,6,0)=0,\"\",VLOOKUP(M19,일정!$B$6:$L$371,6,0)))","v":""},null,{"$f":"IF(MONTH(O19)<>$B$2,\"\",IF(VLOOKUP(O19,일정!$B$6:$L$371,6,0)=0,\"\",VLOOKUP(O19,일정!$B$6:$L$371,6,0)))","v":""},null,null,null,null,null,null,null,null,null,{"$f":"IF(MONTH(C19)<>$B$2,\"\",IF(VLOOKUP(C19,일정!$B$6:$L$371,7,0)=0,\"\",VLOOKUP(C19,일정!$B$6:$L$371,7,0)))","v":""},null,{"$f":"IF(MONTH(E19)<>$B$2,\"\",IF(VLOOKUP(E19,일정!$B$6:$L$371,7,0)=0,\"\",VLOOKUP(E19,일정!$B$6:$L$371,7,0)))","v":""},null,{"$f":"IF(MONTH(G19)<>$B$2,\"\",IF(VLOOKUP(G19,일정!$B$6:$L$371,7,0)=0,\"\",VLOOKUP(G19,일정!$B$6:$L$371,7,0)))","v":""},null,{"$f":"IF(MONTH(I19)<>$B$2,\"\",IF(VLOOKUP(I19,일정!$B$6:$L$371,7,0)=0,\"\",VLOOKUP(I19,일정!$B$6:$L$371,7,0)))","v":""},null,{"$f":"IF(MONTH(K19)<>$B$2,\"\",IF(VLOOKUP(K19,일정!$B$6:$L$371,7,0)=0,\"\",VLOOKUP(K19,일정!$B$6:$L$371,7,0)))","v":""},null,{"$f":"IF(MONTH(M19)<>$B$2,\"\",IF(VLOOKUP(M19,일정!$B$6:$L$371,7,0)=0,\"\",VLOOKUP(M19,일정!$B$6:$L$371,7,0)))","v":""},null,{"$f":"IF(MONTH(O19)<>$B$2,\"\",IF(VLOOKUP(O19,일정!$B$6:$L$371,7,0)=0,\"\",VLOOKUP(O19,일정!$B$6:$L$371,7,0)))","v":""}]
[null,{"$f":"IF(MONTH(C19)<>$B$2,\"\",IF(VLOOKUP(C19,일정!$B$6:$L$371,8,0)=0,\"\",VLOOKUP(C19,일정!$B$6:$L$371,8,0)))","v":""},null,{"$f":"IF(MONTH(E19)<>$B$2,\"\",IF(VLOOKUP(E19,일정!$B$6:$L$371,8,0)=0,\"\",VLOOKUP(E19,일정!$B$6:$L$371,8,0)))","v":""},null,{"$f":"IF(MONTH(G19)<>$B$2,\"\",IF(VLOOKUP(G19,일정!$B$6:$L$371,8,0)=0,\"\",VLOOKUP(G19,일정!$B$6:$L$371,8,0)))","v":""},null,{"$f":"IF(MONTH(I19)<>$B$2,\"\",IF(VLOOKUP(I19,일정!$B$6:$L$371,8,0)=0,\"\",VLOOKUP(I19,일정!$B$6:$L$371,8,0)))","v":""},null,{"$f":"IF(MONTH(K19)<>$B$2,\"\",IF(VLOOKUP(K19,일정!$B$6:$L$371,8,0)=0,\"\",VLOOKUP(K19,일정!$B$6:$L$371,8,0)))","v":""},null,{"$f":"IF(MONTH(M19)<>$B$2,\"\",IF(VLOOKUP(M19,일정!$B$6:$L$371,8,0)=0,\"\",VLOOKUP(M19,일정!$B$6:$L$371,8,0)))","v":""},null,{"$f":"IF(MONTH(O19)<>$B$2,\"\",IF(VLOOKUP(O19,일정!$B$6:$L$371,8,0)=0,\"\",VLOOKUP(O19,일정!$B$6:$L$371,8,0)))","v":""},null,null,null,null,null,null,null,null,null,{"$f":"IF(MONTH(C19)<>$B$2,\"\",IF(VLOOKUP(C19,일정!$B$6:$L$371,9,0)=0,\"\",VLOOKUP(C19,일정!$B$6:$L$371,9,0)))","v":""},null,{"$f":"IF(MONTH(E19)<>$B$2,\"\",IF(VLOOKUP(E19,일정!$B$6:$L$371,9,0)=0,\"\",VLOOKUP(E19,일정!$B$6:$L$371,9,0)))","v":""},null,{"$f":"IF(MONTH(G19)<>$B$2,\"\",IF(VLOOKUP(G19,일정!$B$6:$L$371,9,0)=0,\"\",VLOOKUP(G19,일정!$B$6:$L$371,9,0)))","v":""},null,{"$f":"IF(MONTH(I19)<>$B$2,\"\",IF(VLOOKUP(I19,일정!$B$6:$L$371,9,0)=0,\"\",VLOOKUP(I19,일정!$B$6:$L$371,9,0)))","v":""},null,{"$f":"IF(MONTH(K19)<>$B$2,\"\",IF(VLOOKUP(K19,일정!$B$6:$L$371,9,0)=0,\"\",VLOOKUP(K19,일정!$B$6:$L$371,9,0)))","v":""},null,{"$f":"IF(MONTH(M19)<>$B$2,\"\",IF(VLOOKUP(M19,일정!$B$6:$L$371,9,0)=0,\"\",VLOOKUP(M19,일정!$B$6:$L$371,9,0)))","v":""},null,{"$f":"IF(MONTH(O19)<>$B$2,\"\",IF(VLOOKUP(O19,일정!$B$6:$L$371,9,0)=0,\"\",VLOOKUP(O19,일정!$B$6:$L$371,9,0)))","v":""}]
[null,{"$f":"IF(MONTH(C19)<>$B$2,\"\",IF(VLOOKUP(C19,일정!$B$6:$L$371,10,0)=0,\"\",VLOOKUP(C19,일정!$B$6:$L$371,10,0)))","v":""},null,{"$f":"IF(MONTH(E19)<>$B$2,\"\",IF(VLOOKUP(E19,일정!$B$6:$L$371,10,0)=0,\"\",VLOOKUP(E19,일정!$B$6:$L$371,10,0)))","v":""},null,{"$f":"IF(MONTH(G19)<>$B$2,\"\",IF(VLOOKUP(G19,일정!$B$6:$L$371,10,0)=0,\"\",VLOOKUP(G19,일정!$B$6:$L$371,10,0)))","v":""},null,{"$f":"IF(MONTH(I19)<>$B$2,\"\",IF(VLOOKUP(I19,일정!$B$6:$L$371,10,0)=0,\"\",VLOOKUP(I19,일정!$B$6:$L$371,10,0)))","v":""},null,{"$f":"IF(MONTH(K19)<>$B$2,\"\",IF(VLOOKUP(K19,일정!$B$6:$L$371,10,0)=0,\"\",VLOOKUP(K19,일정!$B$6:$L$371,10,0)))","v":""},null,{"$f":"IF(MONTH(M19)<>$B$2,\"\",IF(VLOOKUP(M19,일정!$B$6:$L$371,10,0)=0,\"\",VLOOKUP(M19,일정!$B$6:$L$371,10,0)))","v":""},null,{"$f":"IF(MONTH(O19)<>$B$2,\"\",IF(VLOOKUP(O19,일정!$B$6:$L$371,10,0)=0,\"\",VLOOKUP(O19,일정!$B$6:$L$371,10,0)))","v":""},null,null,null,null,null,null,null,null,null,{"$f":"IF(MONTH(C19)<>$B$2,\"\",IF(VLOOKUP(C19,일정!$B$6:$L$371,11,0)=0,\"\",VLOOKUP(C19,일정!$B$6:$L$371,11,0)))","v":""},null,{"$f":"IF(MONTH(E19)<>$B$2,\"\",IF(VLOOKUP(E19,일정!$B$6:$L$371,11,0)=0,\"\",VLOOKUP(E19,일정!$B$6:$L$371,11,0)))","v":""},null,{"$f":"IF(MONTH(G19)<>$B$2,\"\",IF(VLOOKUP(G19,일정!$B$6:$L$371,11,0)=0,\"\",VLOOKUP(G19,일정!$B$6:$L$371,11,0)))","v":""},null,{"$f":"IF(MONTH(I19)<>$B$2,\"\",IF(VLOOKUP(I19,일정!$B$6:$L$371,11,0)=0,\"\",VLOOKUP(I19,일정!$B$6:$L$371,11,0)))","v":""},null,{"$f":"IF(MONTH(K19)<>$B$2,\"\",IF(VLOOKUP(K19,일정!$B$6:$L$371,11,0)=0,\"\",VLOOKUP(K19,일정!$B$6:$L$371,11,0)))","v":""},null,{"$f":"IF(MONTH(M19)<>$B$2,\"\",IF(VLOOKUP(M19,일정!$B$6:$L$371,11,0)=0,\"\",VLOOKUP(M19,일정!$B$6:$L$371,11,0)))","v":""},null,{"$f":"IF(MONTH(O19)<>$B$2,\"\",IF(VLOOKUP(O19,일정!$B$6:$L$371,11,0)=0,\"\",VLOOKUP(O19,일정!$B$6:$L$371,11,0)))","v":""}]
[null,{"$f":"IFERROR(INDEX(공휴일이름,MATCH(1,--($B$2=공휴일월)*(DAY(C25)=공휴일일),0)),\"\")","v":""},{"$f":"C7+21","v":"2022-05-22"},{"$f":"IFERROR(INDEX(공휴일이름,MATCH(1,--($B$2=공휴일월)*(DAY(E25)=공휴일일),0)),\"\")","v":""},{"$f":"C7+22","v":"2022-05-23"},{"$f":"IFERROR(INDEX(공휴일이름,MATCH(1,--($B$2=공휴일월)*(DAY(G25)=공휴일일),0)),\"\")","v":""},{"$f":"C7+23","v":"2022-05-24"},{"$f":"IFERROR(INDEX(공휴일이름,MATCH(1,--($B$2=공휴일월)*(DAY(I25)=공휴일일),0)),\"\")","v":""},{"$f":"C7+24","v":"2022-05-25"},{"$f":"IFERROR(INDEX(공휴일이름,MATCH(1,--($B$2=공휴일월)*(DAY(K25)=공휴일일),0)),\"\")","v":""},{"$f":"C7+25","v":"2022-05-26"},{"$f":"IFERROR(INDEX(공휴일이름,MATCH(1,--($B$2=공휴일월)*(DAY(M25)=공휴일일),0)),\"\")","v":""},{"$f":"C7+26","v":"2022-05-27"},{"$f":"IFERROR(INDEX(공휴일이름,MATCH(1,--($B$2=공휴일월)*(DAY(O25)=공휴일일),0)),\"\")","v":""},{"$f":"C7+27","v":"2022-05-28"}]
[null,{"$f":"IF(MONTH(C25)<>$B$2,\"\",IF(VLOOKUP(C25,일정!$B$6:$L$371,2,0)=0,\"\",VLOOKUP(C25,일정!$B$6:$L$371,2,0)))","v":""},null,{"$f":"IF(MONTH(E25)<>$B$2,\"\",IF(VLOOKUP(E25,일정!$B$6:$L$371,2,0)=0,\"\",VLOOKUP(E25,일정!$B$6:$L$371,2,0)))","v":""},null,{"$f":"IF(MONTH(G25)<>$B$2,\"\",IF(VLOOKUP(G25,일정!$B$6:$L$371,2,0)=0,\"\",VLOOKUP(G25,일정!$B$6:$L$371,2,0)))","v":""},null,{"$f":"IF(MONTH(I25)<>$B$2,\"\",IF(VLOOKUP(I25,일정!$B$6:$L$371,2,0)=0,\"\",VLOOKUP(I25,일정!$B$6:$L$371,2,0)))","v":""},null,{"$f":"IF(MONTH(K25)<>$B$2,\"\",IF(VLOOKUP(K25,일정!$B$6:$L$371,2,0)=0,\"\",VLOOKUP(K25,일정!$B$6:$L$371,2,0)))","v":""},null,{"$f":"IF(MONTH(M25)<>$B$2,\"\",IF(VLOOKUP(M25,일정!$B$6:$L$371,2,0)=0,\"\",VLOOKUP(M25,일정!$B$6:$L$371,2,0)))","v":""},null,{"$f":"IF(MONTH(O25)<>$B$2,\"\",IF(VLOOKUP(O25,일정!$B$6:$L$371,2,0)=0,\"\",VLOOKUP(O25,일정!$B$6:$L$371,2,0)))","v":""},null,null,null,null,null,null,null,null,null,{"$f":"IF(MONTH(C25)<>$B$2,\"\",IF(VLOOKUP(C25,일정!$B$6:$L$371,3,0)=0,\"\",VLOOKUP(C25,일정!$B$6:$L$371,3,0)))","v":""},null,{"$f":"IF(MONTH(E25)<>$B$2,\"\",IF(VLOOKUP(E25,일정!$B$6:$L$371,3,0)=0,\"\",VLOOKUP(E25,일정!$B$6:$L$371,3,0)))","v":""},null,{"$f":"IF(MONTH(G25)<>$B$2,\"\",IF(VLOOKUP(G25,일정!$B$6:$L$371,3,0)=0,\"\",VLOOKUP(G25,일정!$B$6:$L$371,3,0)))","v":""},null,{"$f":"IF(MONTH(I25)<>$B$2,\"\",IF(VLOOKUP(I25,일정!$B$6:$L$371,3,0)=0,\"\",VLOOKUP(I25,일정!$B$6:$L$371,3,0)))","v":""},null,{"$f":"IF(MONTH(K25)<>$B$2,\"\",IF(VLOOKUP(K25,일정!$B$6:$L$371,3,0)=0,\"\",VLOOKUP(K25,일정!$B$6:$L$371,3,0)))","v":""},null,{"$f":"IF(MONTH(M25)<>$B$2,\"\",IF(VLOOKUP(M25,일정!$B$6:$L$371,3,0)=0,\"\",VLOOKUP(M25,일정!$B$6:$L$371,3,0)))","v":""},null,{"$f":"IF(MONTH(O25)<>$B$2,\"\",IF(VLOOKUP(O25,일정!$B$6:$L$371,3,0)=0,\"\",VLOOKUP(O25,일정!$B$6:$L$371,3,0)))","v":""}]
[null,{"$f":"IF(MONTH(C25)<>$B$2,\"\",IF(VLOOKUP(C25,일정!$B$6:$L$371,4,0)=0,\"\",VLOOKUP(C25,일정!$B$6:$L$371,4,0)))","v":""},null,{"$f":"IF(MONTH(E25)<>$B$2,\"\",IF(VLOOKUP(E25,일정!$B$6:$L$371,4,0)=0,\"\",VLOOKUP(E25,일정!$B$6:$L$371,4,0)))","v":""},null,{"$f":"IF(MONTH(G25)<>$B$2,\"\",IF(VLOOKUP(G25,일정!$B$6:$L$371,4,0)=0,\"\",VLOOKUP(G25,일정!$B$6:$L$371,4,0)))","v":""},null,{"$f":"IF(MONTH(I25)<>$B$2,\"\",IF(VLOOKUP(I25,일정!$B$6:$L$371,4,0)=0,\"\",VLOOKUP(I25,일정!$B$6:$L$371,4,0)))","v":""},null,{"$f":"IF(MONTH(K25)<>$B$2,\"\",IF(VLOOKUP(K25,일정!$B$6:$L$371,4,0)=0,\"\",VLOOKUP(K25,일정!$B$6:$L$371,4,0)))","v":""},null,{"$f":"IF(MONTH(M25)<>$B$2,\"\",IF(VLOOKUP(M25,일정!$B$6:$L$371,4,0)=0,\"\",VLOOKUP(M25,일정!$B$6:$L$371,4,0)))","v":""},null,{"$f":"IF(MONTH(O25)<>$B$2,\"\",IF(VLOOKUP(O25,일정!$B$6:$L$371,4,0)=0,\"\",VLOOKUP(O25,일정!$B$6:$L$371,4,0)))","v":""},null,null,null,null,null,null,null,null,null,{"$f":"IF(MONTH(C25)<>$B$2,\"\",IF(VLOOKUP(C25,일정!$B$6:$L$371,5,0)=0,\"\",VLOOKUP(C25,일정!$B$6:$L$371,5,0)))","v":""},null,{"$f":"IF(MONTH(E25)<>$B$2,\"\",IF(VLOOKUP(E25,일정!$B$6:$L$371,5,0)=0,\"\",VLOOKUP(E25,일정!$B$6:$L$371,5,0)))","v":""},null,{"$f":"IF(MONTH(G25)<>$B$2,\"\",IF(VLOOKUP(G25,일정!$B$6:$L$371,5,0)=0,\"\",VLOOKUP(G25,일정!$B$6:$L$371,5,0)))","v":""},null,{"$f":"IF(MONTH(I25)<>$B$2,\"\",IF(VLOOKUP(I25,일정!$B$6:$L$371,5,0)=0,\"\",VLOOKUP(I25,일정!$B$6:$L$371,5,0)))","v":""},null,{"$f":"IF(MONTH(K25)<>$B$2,\"\",IF(VLOOKUP(K25,일정!$B$6:$L$371,5,0)=0,\"\",VLOOKUP(K25,일정!$B$6:$L$371,5,0)))","v":""},null,{"$f":"IF(MONTH(M25)<>$B$2,\"\",IF(VLOOKUP(M25,일정!$B$6:$L$371,5,0)=0,\"\",VLOOKUP(M25,일정!$B$6:$L$371,5,0)))","v":""},null,{"$f":"IF(MONTH(O25)<>$B$2,\"\",IF(VLOOKUP(O25,일정!$B$6:$L$371,5,0)=0,\"\",VLOOKUP(O25,일정!$B$6:$L$371,5,0)))","v":""}]
[null,{"$f":"IF(MONTH(C25)<>$B$2,\"\",IF(VLOOKUP(C25,일정!$B$6:$L$371,6,0)=0,\"\",VLOOKUP(C25,일정!$B$6:$L$371,6,0)))","v":""},null,{"$f":"IF(MONTH(E25)<>$B$2,\"\",IF(VLOOKUP(E25,일정!$B$6:$L$371,6,0)=0,\"\",VLOOKUP(E25,일정!$B$6:$L$371,6,0)))","v":""},null,{"$f":"IF(MONTH(G25)<>$B$2,\"\",IF(VLOOKUP(G25,일정!$B$6:$L$371,6,0)=0,\"\",VLOOKUP(G25,일정!$B$6:$L$371,6,0)))","v":""},null,{"$f":"IF(MONTH(I25)<>$B$2,\"\",IF(VLOOKUP(I25,일정!$B$6:$L$371,6,0)=0,\"\",VLOOKUP(I25,일정!$B$6:$L$371,6,0)))","v":""},null,{"$f":"IF(MONTH(K25)<>$B$2,\"\",IF(VLOOKUP(K25,일정!$B$6:$L$371,6,0)=0,\"\",VLOOKUP(K25,일정!$B$6:$L$371,6,0)))","v":""},null,{"$f":"IF(MONTH(M25)<>$B$2,\"\",IF(VLOOKUP(M25,일정!$B$6:$L$371,6,0)=0,\"\",VLOOKUP(M25,일정!$B$6:$L$371,6,0)))","v":""},null,{"$f":"IF(MONTH(O25)<>$B$2,\"\",IF(VLOOKUP(O25,일정!$B$6:$L$371,6,0)=0,\"\",VLOOKUP(O25,일정!$B$6:$L$371,6,0)))","v":""},null,null,null,null,null,null,null,null,null,{"$f":"IF(MONTH(C25)<>$B$2,\"\",IF(VLOOKUP(C25,일정!$B$6:$L$371,7,0)=0,\"\",VLOOKUP(C25,일정!$B$6:$L$371,7,0)))","v":""},null,{"$f":"IF(MONTH(E25)<>$B$2,\"\",IF(VLOOKUP(E25,일정!$B$6:$L$371,7,0)=0,\"\",VLOOKUP(E25,일정!$B$6:$L$371,7,0)))","v":""},null,{"$f":"IF(MONTH(G25)<>$B$2,\"\",IF(VLOOKUP(G25,일정!$B$6:$L$371,7,0)=0,\"\",VLOOKUP(G25,일정!$B$6:$L$371,7,0)))","v":""},null,{"$f":"IF(MONTH(I25)<>$B$2,\"\",IF(VLOOKUP(I25,일정!$B$6:$L$371,7,0)=0,\"\",VLOOKUP(I25,일정!$B$6:$L$371,7,0)))","v":""},null,{"$f":"IF(MONTH(K25)<>$B$2,\"\",IF(VLOOKUP(K25,일정!$B$6:$L$371,7,0)=0,\"\",VLOOKUP(K25,일정!$B$6:$L$371,7,0)))","v":""},null,{"$f":"IF(MONTH(M25)<>$B$2,\"\",IF(VLOOKUP(M25,일정!$B$6:$L$371,7,0)=0,\"\",VLOOKUP(M25,일정!$B$6:$L$371,7,0)))","v":""},null,{"$f":"IF(MONTH(O25)<>$B$2,\"\",IF(VLOOKUP(O25,일정!$B$6:$L$371,7,0)=0,\"\",VLOOKUP(O25,일정!$B$6:$L$371,7,0)))","v":""}]
[null,{"$f":"IF(MONTH(C25)<>$B$2,\"\",IF(VLOOKUP(C25,일정!$B$6:$L$371,8,0)=0,\"\",VLOOKUP(C25,일정!$B$6:$L$371,8,0)))","v":""},null,{"$f":"IF(MONTH(E25)<>$B$2,\"\",IF(VLOOKUP(E25,일정!$B$6:$L$371,8,0)=0,\"\",VLOOKUP(E25,일정!$B$6:$L$371,8,0)))","v":""},null,{"$f":"IF(MONTH(G25)<>$B$2,\"\",IF(VLOOKUP(G25,일정!$B$6:$L$371,8,0)=0,\"\",VLOOKUP(G25,일정!$B$6:$L$371,8,0)))","v":""},null,{"$f":"IF(MONTH(I25)<>$B$2,\"\",IF(VLOOKUP(I25,일정!$B$6:$L$371,8,0)=0,\"\",VLOOKUP(I25,일정!$B$6:$L$371,8,0)))","v":""},null,{"$f":"IF(MONTH(K25)<>$B$2,\"\",IF(VLOOKUP(K25,일정!$B$6:$L$371,8,0)=0,\"\",VLOOKUP(K25,일정!$B$6:$L$371,8,0)))","v":""},null,{"$f":"IF(MONTH(M25)<>$B$2,\"\",IF(VLOOKUP(M25,일정!$B$6:$L$371,8,0)=0,\"\",VLOOKUP(M25,일정!$B$6:$L$371,8,0)))","v":""},null,{"$f":"IF(MONTH(O25)<>$B$2,\"\",IF(VLOOKUP(O25,일정!$B$6:$L$371,8,0)=0,\"\",VLOOKUP(O25,일정!$B$6:$L$371,8,0)))","v":""},null,null,null,null,null,null,null,null,null,{"$f":"IF(MONTH(C25)<>$B$2,\"\",IF(VLOOKUP(C25,일정!$B$6:$L$371,9,0)=0,\"\",VLOOKUP(C25,일정!$B$6:$L$371,9,0)))","v":""},null,{"$f":"IF(MONTH(E25)<>$B$2,\"\",IF(VLOOKUP(E25,일정!$B$6:$L$371,9,0)=0,\"\",VLOOKUP(E25,일정!$B$6:$L$371,9,0)))","v":""},null,{"$f":"IF(MONTH(G25)<>$B$2,\"\",IF(VLOOKUP(G25,일정!$B$6:$L$371,9,0)=0,\"\",VLOOKUP(G25,일정!$B$6:$L$371,9,0)))","v":""},null,{"$f":"IF(MONTH(I25)<>$B$2,\"\",IF(VLOOKUP(I25,일정!$B$6:$L$371,9,0)=0,\"\",VLOOKUP(I25,일정!$B$6:$L$371,9,0)))","v":""},null,{"$f":"IF(MONTH(K25)<>$B$2,\"\",IF(VLOOKUP(K25,일정!$B$6:$L$371,9,0)=0,\"\",VLOOKUP(K25,일정!$B$6:$L$371,9,0)))","v":""},null,{"$f":"IF(MONTH(M25)<>$B$2,\"\",IF(VLOOKUP(M25,일정!$B$6:$L$371,9,0)=0,\"\",VLOOKUP(M25,일정!$B$6:$L$371,9,0)))","v":""},null,{"$f":"IF(MONTH(O25)<>$B$2,\"\",IF(VLOOKUP(O25,일정!$B$6:$L$371,9,0)=0,\"\",VLOOKUP(O25,일정!$B$6:$L$371,9,0)))","v":""}]
[null,{"$f":"IF(MONTH(C25)<>$B$2,\"\",IF(VLOOKUP(C25,일정!$B$6:$L$371,10,0)=0,\"\",VLOOKUP(C25,일정!$B$6:$L$371,10,0)))","v":""},null,{"$f":"IF(MONTH(E25)<>$B$2,\"\",IF(VLOOKUP(E25,일정!$B$6:$L$371,10,0)=0,\"\",VLOOKUP(E25,일정!$B$6:$L$371,10,0)))","v":""},null,{"$f":"IF(MONTH(G25)<>$B$2,\"\",IF(VLOOKUP(G25,일정!$B$6:$L$371,10,0)=0,\"\",VLOOKUP(G25,일정!$B$6:$L$371,10,0)))","v":""},null,{"$f":"IF(MONTH(I25)<>$B$2,\"\",IF(VLOOKUP(I25,일정!$B$6:$L$371,10,0)=0,\"\",VLOOKUP(I25,일정!$B$6:$L$371,10,0)))","v":""},null,{"$f":"IF(MONTH(K25)<>$B$2,\"\",IF(VLOOKUP(K25,일정!$B$6:$L$371,10,0)=0,\"\",VLOOKUP(K25,일정!$B$6:$L$371,10,0)))","v":""},null,{"$f":"IF(MONTH(M25)<>$B$2,\"\",IF(VLOOKUP(M25,일정!$B$6:$L$371,10,0)=0,\"\",VLOOKUP(M25,일정!$B$6:$L$371,10,0)))","v":""},null,{"$f":"IF(MONTH(O25)<>$B$2,\"\",IF(VLOOKUP(O25,일정!$B$6:$L$371,10,0)=0,\"\",VLOOKUP(O25,일정!$B$6:$L$371,10,0)))","v":""},null,null,null,null,null,null,null,null,null,{"$f":"IF(MONTH(C25)<>$B$2,\"\",IF(VLOOKUP(C25,일정!$B$6:$L$371,11,0)=0,\"\",VLOOKUP(C25,일정!$B$6:$L$371,11,0)))","v":""},null,{"$f":"IF(MONTH(E25)<>$B$2,\"\",IF(VLOOKUP(E25,일정!$B$6:$L$371,11,0)=0,\"\",VLOOKUP(E25,일정!$B$6:$L$371,11,0)))","v":""},null,{"$f":"IF(MONTH(G25)<>$B$2,\"\",IF(VLOOKUP(G25,일정!$B$6:$L$371,11,0)=0,\"\",VLOOKUP(G25,일정!$B$6:$L$371,11,0)))","v":""},null,{"$f":"IF(MONTH(I25)<>$B$2,\"\",IF(VLOOKUP(I25,일정!$B$6:$L$371,11,0)=0,\"\",VLOOKUP(I25,일정!$B$6:$L$371,11,0)))","v":""},null,{"$f":"IF(MONTH(K25)<>$B$2,\"\",IF(VLOOKUP(K25,일정!$B$6:$L$371,11,0)=0,\"\",VLOOKUP(K25,일정!$B$6:$L$371,11,0)))","v":""},null,{"$f":"IF(MONTH(M25)<>$B$2,\"\",IF(VLOOKUP(M25,일정!$B$6:$L$371,11,0)=0,\"\",VLOOKUP(M25,일정!$B$6:$L$371,11,0)))","v":""},null,{"$f":"IF(MONTH(O25)<>$B$2,\"\",IF(VLOOKUP(O25,일정!$B$6:$L$371,11,0)=0,\"\",VLOOKUP(O25,일정!$B$6:$L$371,11,0)))","v":""}]
[null,{"$f":"IFERROR(INDEX(공휴일이름,MATCH(1,--($B$2=공휴일월)*(DAY(C31)=공휴일일),0)),\"\")","v":""},{"$f":"C7+28","v":"2022-05-29"},{"$f":"IFERROR(INDEX(공휴일이름,MATCH(1,--($B$2=공휴일월)*(DAY(E31)=공휴일일),0)),\"\")","v":""},{"$f":"C7+29","v":"2022-05-30"},{"$f":"IFERROR(INDEX(공휴일이름,MATCH(1,--($B$2=공휴일월)*(DAY(G31)=공휴일일),0)),\"\")","v":""},{"$f":"C7+30","v":"2022-05-31"},{"$f":"IFERROR(INDEX(공휴일이름,MATCH(1,--($B$2=공휴일월)*(DAY(I31)=공휴일일),0)),\"\")","v":""},{"$f":"C7+31","v":"2022-06-01"},{"$f":"IFERROR(INDEX(공휴일이름,MATCH(1,--($B$2=공휴일월)*(DAY(K31)=공휴일일),0)),\"\")","v":""},{"$f":"C7+32","v":"2022-06-02"},{"$f":"IFERROR(INDEX(공휴일이름,MATCH(1,--($B$2=공휴일월)*(DAY(M31)=공휴일일),0)),\"\")","v":""},{"$f":"C7+33","v":"2022-06-03"},{"$f":"IFERROR(INDEX(공휴일이름,MATCH(1,--($B$2=공휴일월)*(DAY(O31)=공휴일일),0)),\"\")","v":""},{"$f":"C7+34","v":"2022-06-04"}]
[null,{"$f":"IF(MONTH(C31)<>$B$2,\"\",IF(VLOOKUP(C31,일정!$B$6:$L$371,2,0)=0,\"\",VLOOKUP(C31,일정!$B$6:$L$371,2,0)))","v":""},null,{"$f":"IF(MONTH(E31)<>$B$2,\"\",IF(VLOOKUP(E31,일정!$B$6:$L$371,2,0)=0,\"\",VLOOKUP(E31,일정!$B$6:$L$371,2,0)))","v":""},null,{"$f":"IF(MONTH(G31)<>$B$2,\"\",IF(VLOOKUP(G31,일정!$B$6:$L$371,2,0)=0,\"\",VLOOKUP(G31,일정!$B$6:$L$371,2,0)))","v":""},null,{"$f":"IF(MONTH(I31)<>$B$2,\"\",IF(VLOOKUP(I31,일정!$B$6:$L$371,2,0)=0,\"\",VLOOKUP(I31,일정!$B$6:$L$371,2,0)))","v":""},null,{"$f":"IF(MONTH(K31)<>$B$2,\"\",IF(VLOOKUP(K31,일정!$B$6:$L$371,2,0)=0,\"\",VLOOKUP(K31,일정!$B$6:$L$371,2,0)))","v":""},null,{"$f":"IF(MONTH(M31)<>$B$2,\"\",IF(VLOOKUP(M31,일정!$B$6:$L$371,2,0)=0,\"\",VLOOKUP(M31,일정!$B$6:$L$371,2,0)))","v":""},null,{"$f":"IF(MONTH(O31)<>$B$2,\"\",IF(VLOOKUP(O31,일정!$B$6:$L$371,2,0)=0,\"\",VLOOKUP(O31,일정!$B$6:$L$371,2,0)))","v":""},null,null,null,null,null,null,null,null,null,{"$f":"IF(MONTH(C31)<>$B$2,\"\",IF(VLOOKUP(C31,일정!$B$6:$L$371,3,0)=0,\"\",VLOOKUP(C31,일정!$B$6:$L$371,3,0)))","v":""},null,{"$f":"IF(MONTH(E31)<>$B$2,\"\",IF(VLOOKUP(E31,일정!$B$6:$L$371,3,0)=0,\"\",VLOOKUP(E31,일정!$B$6:$L$371,3,0)))","v":""},null,{"$f":"IF(MONTH(G31)<>$B$2,\"\",IF(VLOOKUP(G31,일정!$B$6:$L$371,3,0)=0,\"\",VLOOKUP(G31,일정!$B$6:$L$371,3,0)))","v":""},null,{"$f":"IF(MONTH(I31)<>$B$2,\"\",IF(VLOOKUP(I31,일정!$B$6:$L$371,3,0)=0,\"\",VLOOKUP(I31,일정!$B$6:$L$371,3,0)))","v":""},null,{"$f":"IF(MONTH(K31)<>$B$2,\"\",IF(VLOOKUP(K31,일정!$B$6:$L$371,3,0)=0,\"\",VLOOKUP(K31,일정!$B$6:$L$371,3,0)))","v":""},null,{"$f":"IF(MONTH(M31)<>$B$2,\"\",IF(VLOOKUP(M31,일정!$B$6:$L$371,3,0)=0,\"\",VLOOKUP(M31,일정!$B$6:$L$371,3,0)))","v":""},null,{"$f":"IF(MONTH(O31)<>$B$2,\"\",IF(VLOOKUP(O31,일정!$B$6:$L$371,3,0)=0,\"\",VLOOKUP(O31,일정!$B$6:$L$371,3,0)))","v":""}]
[null,{"$f":"IF(MONTH(C31)<>$B$2,\"\",IF(VLOOKUP(C31,일정!$B$6:$L$371,4,0)=0,\"\",VLOOKUP(C31,일정!$B$6:$L$371,4,0)))","v":""},null,{"$f":"IF(MONTH(E31)<>$B$2,\"\",IF(VLOOKUP(E31,일정!$B$6:$L$371,4,0)=0,\"\",VLOOKUP(E31,일정!$B$6:$L$371,4,0)))","v":""},null,{"$f":"IF(MONTH(G31)<>$B$2,\"\",IF(VLOOKUP(G31,일정!$B$6:$L$371,4,0)=0,\"\",VLOOKUP(G31,일정!$B$6:$L$371,4,0)))","v":""},null,{"$f":"IF(MONTH(I31)<>$B$2,\"\",IF(VLOOKUP(I31,일정!$B$6:$L$371,4,0)=0,\"\",VLOOKUP(I31,일정!$B$6:$L$371,4,0)))","v":""},null,{"$f":"IF(MONTH(K31)<>$B$2,\"\",IF(VLOOKUP(K31,일정!$B$6:$L$371,4,0)=0,\"\",VLOOKUP(K31,일정!$B$6:$L$371,4,0)))","v":""},null,{"$f":"IF(MONTH(M31)<>$B$2,\"\",IF(VLOOKUP(M31,일정!$B$6:$L$371,4,0)=0,\"\",VLOOKUP(M31,일정!$B$6:$L$371,4,0)))","v":""},null,{"$f":"IF(MONTH(O31)<>$B$2,\"\",IF(VLOOKUP(O31,일정!$B$6:$L$371,4,0)=0,\"\",VLOOKUP(O31,일정!$B$6:$L$371,4,0)))","v":""},null,null,null,null,null,null,null,null,null,{"$f":"IF(MONTH(C31)<>$B$2,\"\",IF(VLOOKUP(C31,일정!$B$6:$L$371,5,0)=0,\"\",VLOOKUP(C31,일정!$B$6:$L$371,5,0)))","v":""},null,{"$f":"IF(MONTH(E31)<>$B$2,\"\",IF(VLOOKUP(E31,일정!$B$6:$L$371,5,0)=0,\"\",VLOOKUP(E31,일정!$B$6:$L$371,5,0)))","v":""},null,{"$f":"IF(MONTH(G31)<>$B$2,\"\",IF(VLOOKUP(G31,일정!$B$6:$L$371,5,0)=0,\"\",VLOOKUP(G31,일정!$B$6:$L$371,5,0)))","v":""},null,{"$f":"IF(MONTH(I31)<>$B$2,\"\",IF(VLOOKUP(I31,일정!$B$6:$L$371,5,0)=0,\"\",VLOOKUP(I31,일정!$B$6:$L$371,5,0)))","v":""},null,{"$f":"IF(MONTH(K31)<>$B$2,\"\",IF(VLOOKUP(K31,일정!$B$6:$L$371,5,0)=0,\"\",VLOOKUP(K31,일정!$B$6:$L$371,5,0)))","v":""},null,{"$f":"IF(MONTH(M31)<>$B$2,\"\",IF(VLOOKUP(M31,일정!$B$6:$L$371,5,0)=0,\"\",VLOOKUP(M31,일정!$B$6:$L$371,5,0)))","v":""},null,{"$f":"IF(MONTH(O31)<>$B$2,\"\",IF(VLOOKUP(O31,일정!$B$6:$L$371,5,0)=0,\"\",VLOOKUP(O31,일정!$B$6:$L$371,5,0)))","v":""}]
[null,{"$f":"IF(MONTH(C31)<>$B$2,\"\",IF(VLOOKUP(C31,일정!$B$6:$L$371,6,0)=0,\"\",VLOOKUP(C31,일정!$B$6:$L$371,6,0)))","v":""},null,{"$f":"IF(MONTH(E31)<>$B$2,\"\",IF(VLOOKUP(E31,일정!$B$6:$L$371,6,0)=0,\"\",VLOOKUP(E31,일정!$B$6:$L$371,6,0)))","v":""},null,{"$f":"IF(MONTH(G31)<>$B$2,\"\",IF(VLOOKUP(G31,일정!$B$6:$L$371,6,0)=0,\"\",VLOOKUP(G31,일정!$B$6:$L$371,6,0)))","v":""},null,{"$f":"IF(MONTH(I31)<>$B$2,\"\",IF(VLOOKUP(I31,일정!$B$6:$L$371,6,0)=0,\"\",VLOOKUP(I31,일정!$B$6:$L$371,6,0)))","v":""},null,{"$f":"IF(MONTH(K31)<>$B$2,\"\",IF(VLOOKUP(K31,일정!$B$6:$L$371,6,0)=0,\"\",VLOOKUP(K31,일정!$B$6:$L$371,6,0)))","v":""},null,{"$f":"IF(MONTH(M31)<>$B$2,\"\",IF(VLOOKUP(M31,일정!$B$6:$L$371,6,0)=0,\"\",VLOOKUP(M31,일정!$B$6:$L$371,6,0)))","v":""},null,{"$f":"IF(MONTH(O31)<>$B$2,\"\",IF(VLOOKUP(O31,일정!$B$6:$L$371,6,0)=0,\"\",VLOOKUP(O31,일정!$B$6:$L$371,6,0)))","v":""},null,null,null,null,null,null,null,null,null,{"$f":"IF(MONTH(C31)<>$B$2,\"\",IF(VLOOKUP(C31,일정!$B$6:$L$371,7,0)=0,\"\",VLOOKUP(C31,일정!$B$6:$L$371,7,0)))","v":""},null,{"$f":"IF(MONTH(E31)<>$B$2,\"\",IF(VLOOKUP(E31,일정!$B$6:$L$371,7,0)=0,\"\",VLOOKUP(E31,일정!$B$6:$L$371,7,0)))","v":""},null,{"$f":"IF(MONTH(G31)<>$B$2,\"\",IF(VLOOKUP(G31,일정!$B$6:$L$371,7,0)=0,\"\",VLOOKUP(G31,일정!$B$6:$L$371,7,0)))","v":""},null,{"$f":"IF(MONTH(I31)<>$B$2,\"\",IF(VLOOKUP(I31,일정!$B$6:$L$371,7,0)=0,\"\",VLOOKUP(I31,일정!$B$6:$L$371,7,0)))","v":""},null,{"$f":"IF(MONTH(K31)<>$B$2,\"\",IF(VLOOKUP(K31,일정!$B$6:$L$371,7,0)=0,\"\",VLOOKUP(K31,일정!$B$6:$L$371,7,0)))","v":""},null,{"$f":"IF(MONTH(M31)<>$B$2,\"\",IF(VLOOKUP(M31,일정!$B$6:$L$371,7,0)=0,\"\",VLOOKUP(M31,일정!$B$6:$L$371,7,0)))","v":""},null,{"$f":"IF(MONTH(O31)<>$B$2,\"\",IF(VLOOKUP(O31,일정!$B$6:$L$371,7,0)=0,\"\",VLOOKUP(O31,일정!$B$6:$L$371,7,0)))","v":""}]
[null,{"$f":"IF(MONTH(C31)<>$B$2,\"\",IF(VLOOKUP(C31,일정!$B$6:$L$371,8,0)=0,\"\",VLOOKUP(C31,일정!$B$6:$L$371,8,0)))","v":""},null,{"$f":"IF(MONTH(E31)<>$B$2,\"\",IF(VLOOKUP(E31,일정!$B$6:$L$371,8,0)=0,\"\",VLOOKUP(E31,일정!$B$6:$L$371,8,0)))","v":""},null,{"$f":"IF(MONTH(G31)<>$B$2,\"\",IF(VLOOKUP(G31,일정!$B$6:$L$371,8,0)=0,\"\",VLOOKUP(G31,일정!$B$6:$L$371,8,0)))","v":""},null,{"$f":"IF(MONTH(I31)<>$B$2,\"\",IF(VLOOKUP(I31,일정!$B$6:$L$371,8,0)=0,\"\",VLOOKUP(I31,일정!$B$6:$L$371,8,0)))","v":""},null,{"$f":"IF(MONTH(K31)<>$B$2,\"\",IF(VLOOKUP(K31,일정!$B$6:$L$371,8,0)=0,\"\",VLOOKUP(K31,일정!$B$6:$L$371,8,0)))","v":""},null,{"$f":"IF(MONTH(M31)<>$B$2,\"\",IF(VLOOKUP(M31,일정!$B$6:$L$371,8,0)=0,\"\",VLOOKUP(M31,일정!$B$6:$L$371,8,0)))","v":""},null,{"$f":"IF(MONTH(O31)<>$B$2,\"\",IF(VLOOKUP(O31,일정!$B$6:$L$371,8,0)=0,\"\",VLOOKUP(O31,일정!$B$6:$L$371,8,0)))","v":""},null,null,null,null,null,null,null,null,null,{"$f":"IF(MONTH(C31)<>$B$2,\"\",IF(VLOOKUP(C31,일정!$B$6:$L$371,9,0)=0,\"\",VLOOKUP(C31,일정!$B$6:$L$371,9,0)))","v":""},null,{"$f":"IF(MONTH(E31)<>$B$2,\"\",IF(VLOOKUP(E31,일정!$B$6:$L$371,9,0)=0,\"\",VLOOKUP(E31,일정!$B$6:$L$371,9,0)))","v":""},null,{"$f":"IF(MONTH(G31)<>$B$2,\"\",IF(VLOOKUP(G31,일정!$B$6:$L$371,9,0)=0,\"\",VLOOKUP(G31,일정!$B$6:$L$371,9,0)))","v":""},null,{"$f":"IF(MONTH(I31)<>$B$2,\"\",IF(VLOOKUP(I31,일정!$B$6:$L$371,9,0)=0,\"\",VLOOKUP(I31,일정!$B$6:$L$371,9,0)))","v":""},null,{"$f":"IF(MONTH(K31)<>$B$2,\"\",IF(VLOOKUP(K31,일정!$B$6:$L$371,9,0)=0,\"\",VLOOKUP(K31,일정!$B$6:$L$371,9,0)))","v":""},null,{"$f":"IF(MONTH(M31)<>$B$2,\"\",IF(VLOOKUP(M31,일정!$B$6:$L$371,9,0)=0,\"\",VLOOKUP(M31,일정!$B$6:$L$371,9,0)))","v":""},null,{"$f":"IF(MONTH(O31)<>$B$2,\"\",IF(VLOOKUP(O31,일정!$B$6:$L$371,9,0)=0,\"\",VLOOKUP(O31,일정!$B$6:$L$371,9,0)))","v":""}]
[null,{"$f":"IF(MONTH(C31)<>$B$2,\"\",IF(VLOOKUP(C31,일정!$B$6:$L$371,10,0)=0,\"\",VLOOKUP(C31,일정!$B$6:$L$371,10,0)))","v":""},null,{"$f":"IF(MONTH(E31)<>$B$2,\"\",IF(VLOOKUP(E31,일정!$B$6:$L$371,10,0)=0,\"\",VLOOKUP(E31,일정!$B$6:$L$371,10,0)))","v":""},null,{"$f":"IF(MONTH(G31)<>$B$2,\"\",IF(VLOOKUP(G31,일정!$B$6:$L$371,10,0)=0,\"\",VLOOKUP(G31,일정!$B$6:$L$371,10,0)))","v":""},null,{"$f":"IF(MONTH(I31)<>$B$2,\"\",IF(VLOOKUP(I31,일정!$B$6:$L$371,10,0)=0,\"\",VLOOKUP(I31,일정!$B$6:$L$371,10,0)))","v":""},null,{"$f":"IF(MONTH(K31)<>$B$2,\"\",IF(VLOOKUP(K31,일정!$B$6:$L$371,10,0)=0,\"\",VLOOKUP(K31,일정!$B$6:$L$371,10,0)))","v":""},null,{"$f":"IF(MONTH(M31)<>$B$2,\"\",IF(VLOOKUP(M31,일정!$B$6:$L$371,10,0)=0,\"\",VLOOKUP(M31,일정!$B$6:$L$371,10,0)))","v":""},null,{"$f":"IF(MONTH(O31)<>$B$2,\"\",IF(VLOOKUP(O31,일정!$B$6:$L$371,10,0)=0,\"\",VLOOKUP(O31,일정!$B$6:$L$371,10,0)))","v":""},null,null,null,null,null,null,null,null,null,{"$f":"IF(MONTH(C31)<>$B$2,\"\",IF(VLOOKUP(C31,일정!$B$6:$L$371,11,0)=0,\"\",VLOOKUP(C31,일정!$B$6:$L$371,11,0)))","v":""},null,{"$f":"IF(MONTH(E31)<>$B$2,\"\",IF(VLOOKUP(E31,일정!$B$6:$L$371,11,0)=0,\"\",VLOOKUP(E31,일정!$B$6:$L$371,11,0)))","v":""},null,{"$f":"IF(MONTH(G31)<>$B$2,\"\",IF(VLOOKUP(G31,일정!$B$6:$L$371,11,0)=0,\"\",VLOOKUP(G31,일정!$B$6:$L$371,11,0)))","v":""},null,{"$f":"IF(MONTH(I31)<>$B$2,\"\",IF(VLOOKUP(I31,일정!$B$6:$L$371,11,0)=0,\"\",VLOOKUP(I31,일정!$B$6:$L$371,11,0)))","v":""},null,{"$f":"IF(MONTH(K31)<>$B$2,\"\",IF(VLOOKUP(K31,일정!$B$6:$L$371,11,0)=0,\"\",VLOOKUP(K31,일정!$B$6:$L$371,11,0)))","v":""},null,{"$f":"IF(MONTH(M31)<>$B$2,\"\",IF(VLOOKUP(M31,일정!$B$6:$L$371,11,0)=0,\"\",VLOOKUP(M31,일정!$B$6:$L$371,11,0)))","v":""},null,{"$f":"IF(MONTH(O31)<>$B$2,\"\",IF(VLOOKUP(O31,일정!$B$6:$L$371,11,0)=0,\"\",VLOOKUP(O31,일정!$B$6:$L$371,11,0)))","v":""}]
[null,{"$f":"IFERROR(INDEX(공휴일이름,MATCH(1,--($B$2=공휴일월)*(DAY(C37)=공휴일일),0)),\"\")","v":"어린이날"},{"$f":"C7+35","v":"2022-06-05"},{"$f":"IFERROR(INDEX(공휴일이름,MATCH(1,--($B$2=공휴일월)*(DAY(E37)=공휴일일),0)),\"\")","v":""},{"$f":"C7+36","v":"2022-06-06"},{"$f":"IFERROR(INDEX(공휴일이름,MATCH(1,--($B$2=공휴일월)*(DAY(G37)=공휴일일),0)),\"\")","v":""},{"$f":"C7+37","v":"2022-06-07"},{"$f":"IFERROR(INDEX(공휴일이름,MATCH(1,--($B$2=공휴일월)*(DAY(I37)=공휴일일),0)),\"\")","v":"석가탄신일"},{"$f":"C7+38","v":"2022-06-08"},{"$f":"IFERROR(INDEX(공휴일이름,MATCH(1,--($B$2=공휴일월)*(DAY(K37)=공휴일일),0)),\"\")","v":""},{"$f":"C7+39","v":"2022-06-09"},{"$f":"IFERROR(INDEX(공휴일이름,MATCH(1,--($B$2=공휴일월)*(DAY(M37)=공휴일일),0)),\"\")","v":""},{"$f":"C7+40","v":"2022-06-10"},{"$f":"IFERROR(INDEX(공휴일이름,MATCH(1,--($B$2=공휴일월)*(DAY(O37)=공휴일일),0)),\"\")","v":""},{"$f":"C7+41","v":"2022-06-11"}]
[null,{"$f":"IF(MONTH(C37)<>$B$2,\"\",IF(VLOOKUP(C37,일정!$B$6:$L$371,2,0)=0,\"\",VLOOKUP(C37,일정!$B$6:$L$371,2,0)))","v":""},null,{"$f":"IF(MONTH(E37)<>$B$2,\"\",IF(VLOOKUP(E37,일정!$B$6:$L$371,2,0)=0,\"\",VLOOKUP(E37,일정!$B$6:$L$371,2,0)))","v":""},null,{"$f":"IF(MONTH(G37)<>$B$2,\"\",IF(VLOOKUP(G37,일정!$B$6:$L$371,2,0)=0,\"\",VLOOKUP(G37,일정!$B$6:$L$371,2,0)))","v":""},null,{"$f":"IF(MONTH(I37)<>$B$2,\"\",IF(VLOOKUP(I37,일정!$B$6:$L$371,2,0)=0,\"\",VLOOKUP(I37,일정!$B$6:$L$371,2,0)))","v":""},null,{"$f":"IF(MONTH(K37)<>$B$2,\"\",IF(VLOOKUP(K37,일정!$B$6:$L$371,2,0)=0,\"\",VLOOKUP(K37,일정!$B$6:$L$371,2,0)))","v":""},null,{"$f":"IF(MONTH(M37)<>$B$2,\"\",IF(VLOOKUP(M37,일정!$B$6:$L$371,2,0)=0,\"\",VLOOKUP(M37,일정!$B$6:$L$371,2,0)))","v":""},null,{"$f":"IF(MONTH(O37)<>$B$2,\"\",IF(VLOOKUP(O37,일정!$B$6:$L$371,2,0)=0,\"\",VLOOKUP(O37,일정!$B$6:$L$371,2,0)))","v":""},null,null,null,null,null,null,null,null,null,{"$f":"IF(MONTH(C37)<>$B$2,\"\",IF(VLOOKUP(C37,일정!$B$6:$L$371,3,0)=0,\"\",VLOOKUP(C37,일정!$B$6:$L$371,3,0)))","v":""},null,{"$f":"IF(MONTH(E37)<>$B$2,\"\",IF(VLOOKUP(E37,일정!$B$6:$L$371,3,0)=0,\"\",VLOOKUP(E37,일정!$B$6:$L$371,3,0)))","v":""},null,{"$f":"IF(MONTH(G37)<>$B$2,\"\",IF(VLOOKUP(G37,일정!$B$6:$L$371,3,0)=0,\"\",VLOOKUP(G37,일정!$B$6:$L$371,3,0)))","v":""},null,{"$f":"IF(MONTH(I37)<>$B$2,\"\",IF(VLOOKUP(I37,일정!$B$6:$L$371,3,0)=0,\"\",VLOOKUP(I37,일정!$B$6:$L$371,3,0)))","v":""},null,{"$f":"IF(MONTH(K37)<>$B$2,\"\",IF(VLOOKUP(K37,일정!$B$6:$L$371,3,0)=0,\"\",VLOOKUP(K37,일정!$B$6:$L$371,3,0)))","v":""},null,{"$f":"IF(MONTH(M37)<>$B$2,\"\",IF(VLOOKUP(M37,일정!$B$6:$L$371,3,0)=0,\"\",VLOOKUP(M37,일정!$B$6:$L$371,3,0)))","v":""},null,{"$f":"IF(MONTH(O37)<>$B$2,\"\",IF(VLOOKUP(O37,일정!$B$6:$L$371,3,0)=0,\"\",VLOOKUP(O37,일정!$B$6:$L$371,3,0)))","v":""}]
[null,{"$f":"IF(MONTH(C37)<>$B$2,\"\",IF(VLOOKUP(C37,일정!$B$6:$L$371,4,0)=0,\"\",VLOOKUP(C37,일정!$B$6:$L$371,4,0)))","v":""},null,{"$f":"IF(MONTH(E37)<>$B$2,\"\",IF(VLOOKUP(E37,일정!$B$6:$L$371,4,0)=0,\"\",VLOOKUP(E37,일정!$B$6:$L$371,4,0)))","v":""},null,{"$f":"IF(MONTH(G37)<>$B$2,\"\",IF(VLOOKUP(G37,일정!$B$6:$L$371,4,0)=0,\"\",VLOOKUP(G37,일정!$B$6:$L$371,4,0)))","v":""},null,{"$f":"IF(MONTH(I37)<>$B$2,\"\",IF(VLOOKUP(I37,일정!$B$6:$L$371,4,0)=0,\"\",VLOOKUP(I37,일정!$B$6:$L$371,4,0)))","v":""},null,{"$f":"IF(MONTH(K37)<>$B$2,\"\",IF(VLOOKUP(K37,일정!$B$6:$L$371,4,0)=0,\"\",VLOOKUP(K37,일정!$B$6:$L$371,4,0)))","v":""},null,{"$f":"IF(MONTH(M37)<>$B$2,\"\",IF(VLOOKUP(M37,일정!$B$6:$L$371,4,0)=0,\"\",VLOOKUP(M37,일정!$B$6:$L$371,4,0)))","v":""},null,{"$f":"IF(MONTH(O37)<>$B$2,\"\",IF(VLOOKUP(O37,일정!$B$6:$L$371,4,0)=0,\"\",VLOOKUP(O37,일정!$B$6:$L$371,4,0)))","v":""},null,null,null,null,null,null,null,null,null,{"$f":"IF(MONTH(C37)<>$B$2,\"\",IF(VLOOKUP(C37,일정!$B$6:$L$371,5,0)=0,\"\",VLOOKUP(C37,일정!$B$6:$L$371,5,0)))","v":""},null,{"$f":"IF(MONTH(E37)<>$B$2,\"\",IF(VLOOKUP(E37,일정!$B$6:$L$371,5,0)=0,\"\",VLOOKUP(E37,일정!$B$6:$L$371,5,0)))","v":""},null,{"$f":"IF(MONTH(G37)<>$B$2,\"\",IF(VLOOKUP(G37,일정!$B$6:$L$371,5,0)=0,\"\",VLOOKUP(G37,일정!$B$6:$L$371,5,0)))","v":""},null,{"$f":"IF(MONTH(I37)<>$B$2,\"\",IF(VLOOKUP(I37,일정!$B$6:$L$371,5,0)=0,\"\",VLOOKUP(I37,일정!$B$6:$L$371,5,0)))","v":""},null,{"$f":"IF(MONTH(K37)<>$B$2,\"\",IF(VLOOKUP(K37,일정!$B$6:$L$371,5,0)=0,\"\",VLOOKUP(K37,일정!$B$6:$L$371,5,0)))","v":""},null,{"$f":"IF(MONTH(M37)<>$B$2,\"\",IF(VLOOKUP(M37,일정!$B$6:$L$371,5,0)=0,\"\",VLOOKUP(M37,일정!$B$6:$L$371,5,0)))","v":""},null,{"$f":"IF(MONTH(O37)<>$B$2,\"\",IF(VLOOKUP(O37,일정!$B$6:$L$371,5,0)=0,\"\",VLOOKUP(O37,일정!$B$6:$L$371,5,0)))","v":""}]
[null,{"$f":"IF(MONTH(C37)<>$B$2,\"\",IF(VLOOKUP(C37,일정!$B$6:$L$371,6,0)=0,\"\",VLOOKUP(C37,일정!$B$6:$L$371,6,0)))","v":""},null,{"$f":"IF(MONTH(E37)<>$B$2,\"\",IF(VLOOKUP(E37,일정!$B$6:$L$371,6,0)=0,\"\",VLOOKUP(E37,일정!$B$6:$L$371,6,0)))","v":""},null,{"$f":"IF(MONTH(G37)<>$B$2,\"\",IF(VLOOKUP(G37,일정!$B$6:$L$371,6,0)=0,\"\",VLOOKUP(G37,일정!$B$6:$L$371,6,0)))","v":""},null,{"$f":"IF(MONTH(I37)<>$B$2,\"\",IF(VLOOKUP(I37,일정!$B$6:$L$371,6,0)=0,\"\",VLOOKUP(I37,일정!$B$6:$L$371,6,0)))","v":""},null,{"$f":"IF(MONTH(K37)<>$B$2,\"\",IF(VLOOKUP(K37,일정!$B$6:$L$371,6,0)=0,\"\",VLOOKUP(K37,일정!$B$6:$L$371,6,0)))","v":""},null,{"$f":"IF(MONTH(M37)<>$B$2,\"\",IF(VLOOKUP(M37,일정!$B$6:$L$371,6,0)=0,\"\",VLOOKUP(M37,일정!$B$6:$L$371,6,0)))","v":""},null,{"$f":"IF(MONTH(O37)<>$B$2,\"\",IF(VLOOKUP(O37,일정!$B$6:$L$371,6,0)=0,\"\",VLOOKUP(O37,일정!$B$6:$L$371,6,0)))","v":""},null,null,null,null,null,null,null,null,null,{"$f":"IF(MONTH(C37)<>$B$2,\"\",IF(VLOOKUP(C37,일정!$B$6:$L$371,7,0)=0,\"\",VLOOKUP(C37,일정!$B$6:$L$371,7,0)))","v":""},null,{"$f":"IF(MONTH(E37)<>$B$2,\"\",IF(VLOOKUP(E37,일정!$B$6:$L$371,7,0)=0,\"\",VLOOKUP(E37,일정!$B$6:$L$371,7,0)))","v":""},null,{"$f":"IF(MONTH(G37)<>$B$2,\"\",IF(VLOOKUP(G37,일정!$B$6:$L$371,7,0)=0,\"\",VLOOKUP(G37,일정!$B$6:$L$371,7,0)))","v":""},null,{"$f":"IF(MONTH(I37)<>$B$2,\"\",IF(VLOOKUP(I37,일정!$B$6:$L$371,7,0)=0,\"\",VLOOKUP(I37,일정!$B$6:$L$371,7,0)))","v":""},null,{"$f":"IF(MONTH(K37)<>$B$2,\"\",IF(VLOOKUP(K37,일정!$B$6:$L$371,7,0)=0,\"\",VLOOKUP(K37,일정!$B$6:$L$371,7,0)))","v":""},null,{"$f":"IF(MONTH(M37)<>$B$2,\"\",IF(VLOOKUP(M37,일정!$B$6:$L$371,7,0)=0,\"\",VLOOKUP(M37,일정!$B$6:$L$371,7,0)))","v":""},null,{"$f":"IF(MONTH(O37)<>$B$2,\"\",IF(VLOOKUP(O37,일정!$B$6:$L$371,7,0)=0,\"\",VLOOKUP(O37,일정!$B$6:$L$371,7,0)))","v":""}]
[null,{"$f":"IF(MONTH(C37)<>$B$2,\"\",IF(VLOOKUP(C37,일정!$B$6:$L$371,8,0)=0,\"\",VLOOKUP(C37,일정!$B$6:$L$371,8,0)))","v":""},null,{"$f":"IF(MONTH(E37)<>$B$2,\"\",IF(VLOOKUP(E37,일정!$B$6:$L$371,8,0)=0,\"\",VLOOKUP(E37,일정!$B$6:$L$371,8,0)))","v":""},null,{"$f":"IF(MONTH(G37)<>$B$2,\"\",IF(VLOOKUP(G37,일정!$B$6:$L$371,8,0)=0,\"\",VLOOKUP(G37,일정!$B$6:$L$371,8,0)))","v":""},null,{"$f":"IF(MONTH(I37)<>$B$2,\"\",IF(VLOOKUP(I37,일정!$B$6:$L$371,8,0)=0,\"\",VLOOKUP(I37,일정!$B$6:$L$371,8,0)))","v":""},null,{"$f":"IF(MONTH(K37)<>$B$2,\"\",IF(VLOOKUP(K37,일정!$B$6:$L$371,8,0)=0,\"\",VLOOKUP(K37,일정!$B$6:$L$371,8,0)))","v":""},null,{"$f":"IF(MONTH(M37)<>$B$2,\"\",IF(VLOOKUP(M37,일정!$B$6:$L$371,8,0)=0,\"\",VLOOKUP(M37,일정!$B$6:$L$371,8,0)))","v":""},null,{"$f":"IF(MONTH(O37)<>$B$2,\"\",IF(VLOOKUP(O37,일정!$B$6:$L$371,8,0)=0,\"\",VLOOKUP(O37,일정!$B$6:$L$371,8,0)))","v":""},null,null,null,null,null,null,null,null,null,{"$f":"IF(MONTH(C37)<>$B$2,\"\",IF(VLOOKUP(C37,일정!$B$6:$L$371,9,0)=0,\"\",VLOOKUP(C37,일정!$B$6:$L$371,9,0)))","v":""},null,{"$f":"IF(MONTH(E37)<>$B$2,\"\",IF(VLOOKUP(E37,일정!$B$6:$L$371,9,0)=0,\"\",VLOOKUP(E37,일정!$B$6:$L$371,9,0)))","v":""},null,{"$f":"IF(MONTH(G37)<>$B$2,\"\",IF(VLOOKUP(G37,일정!$B$6:$L$371,9,0)=0,\"\",VLOOKUP(G37,일정!$B$6:$L$371,9,0)))","v":""},null,{"$f":"IF(MONTH(I37)<>$B$2,\"\",IF(VLOOKUP(I37,일정!$B$6:$L$371,9,0)=0,\"\",VLOOKUP(I37,일정!$B$6:$L$371,9,0)))","v":""},null,{"$f":"IF(MONTH(K37)<>$B$2,\"\",IF(VLOOKUP(K37,일정!$B$6:$L$371,9,0)=0,\"\",VLOOKUP(K37,일정!$B$6:$L$371,9,0)))","v":""},null,{"$f":"IF(MONTH(M37)<>$B$2,\"\",IF(VLOOKUP(M37,일정!$B$6:$L$371,9,0)=0,\"\",VLOOKUP(M37,일정!$B$6:$L$371,9,0)))","v":""},null,{"$f":"IF(MONTH(O37)<>$B$2,\"\",IF(VLOOKUP(O37,일정!$B$6:$L$371,9,0)=0,\"\",VLOOKUP(O37,일정!$B$6:$L$371,9,0)))","v":""}]
[null,{"$f":"IF(MONTH(C37)<>$B$2,\"\",IF(VLOOKUP(C37,일정!$B$6:$L$371,10,0)=0,\"\",VLOOKUP(C37,일정!$B$6:$L$371,10,0)))","v":""},null,{"$f":"IF(MONTH(E37)<>$B$2,\"\",IF(VLOOKUP(E37,일정!$B$6:$L$371,10,0)=0,\"\",VLOOKUP(E37,일정!$B$6:$L$371,10,0)))","v":""},null,{"$f":"IF(MONTH(G37)<>$B$2,\"\",IF(VLOOKUP(G37,일정!$B$6:$L$371,10,0)=0,\"\",VLOOKUP(G37,일정!$B$6:$L$371,10,0)))","v":""},null,{"$f":"IF(MONTH(I37)<>$B$2,\"\",IF(VLOOKUP(I37,일정!$B$6:$L$371,10,0)=0,\"\",VLOOKUP(I37,일정!$B$6:$L$371,10,0)))","v":""},null,{"$f":"IF(MONTH(K37)<>$B$2,\"\",IF(VLOOKUP(K37,일정!$B$6:$L$371,10,0)=0,\"\",VLOOKUP(K37,일정!$B$6:$L$371,10,0)))","v":""},null,{"$f":"IF(MONTH(M37)<>$B$2,\"\",IF(VLOOKUP(M37,일정!$B$6:$L$371,10,0)=0,\"\",VLOOKUP(M37,일정!$B$6:$L$371,10,0)))","v":""},null,{"$f":"IF(MONTH(O37)<>$B$2,\"\",IF(VLOOKUP(O37,일정!$B$6:$L$371,10,0)=0,\"\",VLOOKUP(O37,일정!$B$6:$L$371,10,0)))","v":""},null,null,null,null,null,null,null,null,null,{"$f":"IF(MONTH(C37)<>$B$2,\"\",IF(VLOOKUP(C37,일정!$B$6:$L$371,11,0)=0,\"\",VLOOKUP(C37,일정!$B$6:$L$371,11,0)))","v":""},null,{"$f":"IF(MONTH(E37)<>$B$2,\"\",IF(VLOOKUP(E37,일정!$B$6:$L$371,11,0)=0,\"\",VLOOKUP(E37,일정!$B$6:$L$371,11,0)))","v":""},null,{"$f":"IF(MONTH(G37)<>$B$2,\"\",IF(VLOOKUP(G37,일정!$B$6:$L$371,11,0)=0,\"\",VLOOKUP(G37,일정!$B$6:$L$371,11,0)))","v":""},null,{"$f":"IF(MONTH(I37)<>$B$2,\"\",IF(VLOOKUP(I37,일정!$B$6:$L$371,11,0)=0,\"\",VLOOKUP(I37,일정!$B$6:$L$371,11,0)))","v":""},null,{"$f":"IF(MONTH(K37)<>$B$2,\"\",IF(VLOOKUP(K37,일정!$B$6:$L$371,11,0)=0,\"\",VLOOKUP(K37,일정!$B$6:$L$371,11,0)))","v":""},null,{"$f":"IF(MONTH(M37)<>$B$2,\"\",IF(VLOOKUP(M37,일정!$B$6:$L$371,11,0)=0,\"\",VLOOKUP(M37,일정!$B$6:$L$371,11,0)))","v":""},null,{"$f":"IF(MONTH(O37)<>$B$2,\"\",IF(VLOOKUP(O37,일정!$B$6:$L$371,11,0)=0,\"\",VLOOKUP(O37,일정!$B$6:$L$371,11,0)))","v":""}]
[1,false,null,false,null,false,null,false,null,false,null,false,null,false]
[2,false,null,false,null,false,null,false,null,false,null,false,null,false]
[3,false,null,false,null,false,null,false,null,false,null,false,null,false]
[4,false,null,false,null,false,null,false,null,false,null,false,null,false]
[5,false,null,false,null,false,null,false,null,false,null,false,null,false]
[6,false,null,false,null,false,null,false,null,false,null,false,null,false]
[]
[null,null,null,null,null,null,null,null,null,null,null,"달성률",null,{"$f":"COUNTIF(B43:N48,\"TRUE\")/TEXT(DATE($D$2,$B$2+1,1)-1,\"DD\")","v":0}]
[null,null,null,null,null,null,null,null,null,null,null,"목표 달성 여부",null,{"$f":"IF(N50>=0.6,\"달성\",\"미달성\")","v":"미달성"}]
[]
[]
[]
[]
[]
[]
[]
[]
[]
[]
[]
[]
[]
[]
[]
[]
[]
[]
[]
[]
[]
[]
[]
[]
[]
[]
[]
[]
[]
[]
[]
[]
[]
[]
[]
[]
[]
[]
[]
[]
[]
[]
[]
[]
[]
[]
[]
[]
[]
[]
[]
[]
[]
[]
[]
[]
[]
[]
[]
[]
[]
[]
[]
[]
[]
[]
[]
[]
[]
[]
[]
[]
[]
[]
[]
[]
[]
[]
[]
[]
[]
[]
[]
[]
[]
[]
[]
[]
[]
[]
[]
[]
[]
[]
[]
[]
[]
[]
[]
[]
[]
[]
[]
[]
[]
[]
[]
[]
[]
[]
[]
[]
[]
[]
[]
[]
[]
[]
[]
[]
[]
[]
[]
[]
[]
[]
[]
[]
[]
[]
[]
[]
[]
[]
[]
[]
[]
[]
[]
[]
[]
[]
[]
[]
[]
[]
[]
[]
[]
[]
[]
[]
[]
[]
[]
[]
[]
[]
[]
[]
[]
[]
[]
[]
[]
[]
[]
[]
[]
[]
[]
[]
[]
[]
[]
[]
[]
[]
[]
[]
[]
[]
[]
[]
[]
[]
[]
[]
[]
[]
[]
[]
[]
[]
[]
[]
[]
[]
[]
[]
[]
[]
[]
[]
[]
[]
[]
[]
[]
[]
[]
[]
[]
[]
[]
[]
[]
[]
[]
[]
[]
[]
[]
[]
[]
[]
[]
[]
[]
[]
[]
[]
[]
[]
[]
[]
[]
[]
[]
[]
[]
[]
[]
[]
[]
[]
[]
[]
[]
[]
[]
[]
[]
[]
[]
[]
[]
[]
[]
[]
[]
[]
[]
[]
[]
[]
[]
[]
[]
[]
[]
[]
[]
[]
[]
[]
[]
[]
[]
[]
[]
[]
[]
[]
[]
[]
[]
[]
[]
[]
[]
[]
[]
[]
[]
[]
[]
[]
[]
[]
[]
[]
[]
[]
[]
[]
[]
[]
[]
[]
[]
[]
[]
[]
[]
[]
[]
[]
[]
[]
[]
[]
[]
[]
[]
[]
[]
[]
[]
[]
[]
[]
[]
[]
[]
[]
[]
[]
[]
[]
[]
[]
[]
[]
[]
[]
[]
[]
[]
[]
[]
[]
[]
[]
[]
[]
[]
[]
[]
[]
[]
[]
[]
[]
[]
[]
[]
[]
[]
[]
[]
[]
[]
[]
[]
[]
[]
[]
[]
[]
[]
[]
[]
[]
[]
[]
[]
[]
[]
[]
[]
[]
[]
[]
[]
[]
[]
[]
[]
[]
[]
[]
[]
[]
[]
[]
[]
[]
[]
[]
[]
[]
[]
[]
[]
[]
[]
[]
[]
[]
[]
[]
[]
[]
[]
[]
[]
[]
[]
[]
[]
[]
[]
[]
[]
[]
[]
[]
[]
[]
[]
[]
[]
[]
[]
[]
[]
[]
[]
[]
[]
[]
[]
[]
[]
[]
[]
[]
[]
[]
[]
[]
[]
[]
[]
[]
[]
[]
[]
[]
[]
[]
[]
[]
[]
[]
[]
[]
[]
[]
[]
[]
[]
[]
[]
[]
[]
[]
[]
[]
[]
[]
[]
[]
[]
[]
[]
[]
[]
[]
[]
[]
[]
[]
[]
[]
[]
[]
[]
[]
[]
[]
[]
[]
[]
[]
[]
[]
[]
[]
[]
[]
[]
[]
[]
[]
[]
[]
[]
[]
[]
[]
[]
[]
[]
[]
[]
[]
[]
[]
[]
[]
[]
[]
[]
[]
[]
[]
[]
[]
[]
[]
[]
[]
[]
[]
[]
[]
[]
[]
[]
[]
[]
[]
[]
[]
[]
[]
[]
[]
[]
[]
[]
[]
[]
[]
[]
[]
[]
[]
[]
[]
[]
[]
[]
[]
[]
[]
[]
[]
[]
[]
[]
[]
[]
[]
[]
[]
[]
[]
[]
[]
[]
[]
[]
[]
[]
[]
[]
[]
[]
[]
[]
[]
[]
[]
[]
[]
[]
[]
[]
[]
[]
[]
[]
[]
[]
[]
[]
[]
[]
[]
[]
[]
[]
[]
[]
[]
[]
[]
[]
[]
[]
[]
[]
[]
[]
[]
[]
[]
[]
[]
[]
[]
[]
[]
[]
[]
[]
[]
[]
[]
[]
[]
[]
[]
[]
[]
[]
[]
[]
[]
[]
[]
[]
[]
[]
[]
[]
[]
[]
[]
[]
[]
[]
[]
[]
[]
[]
[]
[]
[]
[]
[]
[]
[]
[]
[]
[]
[]
[]
[]
[]
[]
[]
[]
[]
[]
[]
[]
[]
[]
[]
[]
[]
[]
[]
[]
[]
[]
[]
[]
[]
[]
[]
[]
[]
[]
[]
[]
[]
[]
[]
[]
[]
[]
[]
[]
[]
[]
[]
[]
[]
[]
[]
[]
[]
[]
[]
[]
[]
[]
[]
[]
[]
[]
[]
[]
[]
[]
[]
[]
[]
[]
[]
[]
[]
[]
[]
[]
[]
[]
[]
[]
[]
[]
[]
[]
[]
[]
[]
[]
[]
[]
[]
[]
[]
[]
[]
[]
[]
[]
[]
[]
[]
[]
[]
[]
[]
[]
[]
[]
[]
[]
[]
[]
[]
[]
[]
[]
[]
[]
[]
[]
[]
[]
[]
[]
[]
[]
[]
[]
[]
[]
[]
[]
[]
[]
[]
[]
[]
[]
[]
[]
[]
[]
[]
[]
[]
[]
[]
[]
[]
[]
[]
[]
[]
[]
[]
[]
[]
[]
[]
[]
[]
[]
[]
[]
[]
[]
[]
[]
[]
[]
[]
[]
[]
[]
[]
[]
[]
[]
[]
[]
[]
[]
[]
[]
[]
[]
[]
[]
[]
[]
[]
[]
[]
[]
[]
[]
[]
[]
[]
[]
[]
[]
[]
[]
[]
[]
[]
[]
[]
[]
[]
[]
[]
[]
[]
[]
[]
[]
[]
[]
[]
[]
[]
[]
[]
[]
[]
[]
[]
[]
[]
[]
[]
[]
[]
[]
[]
[]
[]
[]
[]
[]
[]
[]
[]
[]
[]
[]
[]
[]
[]
[]
[]
[]
[]
[]
[]
[]
[]
[]
[]
[]
[]
[]
[]
[]
[]
[]
[]
[]
[]
[]
[]
[]
[]
[]
[]
[]
[]
[]
[]
[]
[]
[]
[]
[]
[]
[]
[]
[]
[]
[]
[]
[]
[]
[]
[]
[]
[]
[]
[]
[]
[]
[]
[]
[]
[]
[]
[]
[]
[]
[]
[]
[]
[]
[]
[]
[]
[]
[]
[]
[]
[]
[]
[]
[]
[]
[]
[]
[]
[]
[]
[]
[]
[]
[]
[]
[]
[]
[]
[]
[]
[]
[]
[]
[]
[]
[]
[]
[]
[]
[]
[]
[]
[]
[]
[]
[]
[]
[]
[]
[]
[]
[]
[]
[]
[]
[]
[]
[]
[]
[]
[]
[]
[]
[]
[]
[]
[]
[]
[]
[]
[]
[]
[]
[]
[]
[]
[]
[]
[]
[]
[]
[]
[]
[]
[]
[]
[]
[]
[]
[]
[]
[]
[]
[]
[]
[]
[]
[]
[]
[]
[]
[]
[]
[]
[]
[]
[]
[]
[]
[]
[]
[]
[]
[]
[]
[]
[]
[]
[]
[]
[]
[]
[]
[]
[]
[]
[]
[]
[]
[]
[]
[]
[]
[]
[]
[]
[]
[]
[]
[]
[]
[]
[]
[]
[]
[]
[]
[]
[]
[]
[]
[]
[]
[]
[]
[]
[]
[]
[]
[]
[]
[]
[]
[]
[]
[]
[]
[]
[]
[]
[]
[]
[]
[]
[]
[]
[]
[]
[]
[]
[]
[]
[]
[]
[]
[]
[]
[]
[]
[]
[]
[]
[]
[]
[]
[]
[]
[]
[]
[]
[]
[]
[]
[]
[]
[]
[]
[]
[]
[]
[]
[]
[]
[]
[]
[]
[]
[]
[]
[]
[]
[]
[]
[]
[]
[]
[]
[]
[]
[]
[]
[]
[]
[]
[]
[]
[]
[]
[]
[]
[]
[]
[]
[]
[]
[]
[]
[]
[]
[]
[]
[]
[]
[]
[]
[]
[]
[]
[]
[]
[]
[]
[]
[]
[]
[]
[]
[]
[]
[]
[]
[]
[]
[]
[]
[]
[]
[]
[]
[]
[]
[]
[]
[]
[]
[]
[]
[]
[]
[]
[]
[]
[]
[]
[]
[]
[]
[]
[]
[]
[]
[]
[]
[]
[]
[]
[]
[]
[]
[]
[]
[]
[]
[]
[]
[]
[]
[]
[]
[]
[]
[]
[]
[]
[]
[]
[]
[]
[]
[]
[]
[]
[]
[]
[]
[]
[]
[]
[]
[]
[]
[]
[]
[]
[]
[]
[]
[]
[]
[]
[]
[]
[]
[]
[]
[]
[]
[]
[]
[]
[]
[]
[]
[]
[]
[]
[]
[]
[]
[]
[]
[]
[]
[]
[]
[]
[]
[]
[]
[]
[]
[]
[]
[]
[]
[]
[]
[]
[]
[]
[]
[]
[]
[]
[]
[]
[]
[]
[]
[]
[]
[]
[]
[]
[]
[]
[]
[]
[]
[]
[]
[]
[]
[]
[]
[]
[]
[]
[]
[]
[]
[]
[]
[]
[]
[]
[]
[]
[]
[]
[]
[]
[]
[]
[]
[]
[]
[]
[]
[]
[]
[]
[]
[]
[]
[]
[]
[]
[]
[]
[]
[]
[]
[]
[]
[]
[]
[]
[]
[]
[]
[]
[]
[]
[]
[]
[]
[]
[]
[]
[]
[]
[]
[]
[]
[]
[]
[]
[]
[]
[]
[]
[]
[]
[]
[]
[]
[]
[]
[]
[]
[]
[]
[]
[]
[]
[]
[]
[]
[]
[]
[]
[]
[]
[]
[]
[]
[]
[]
[]
[]
[]
[]
[]
[]
[]
[]
[]
[]
[]
[]
[]
[]
[]
[]
[]
[]
[]
[]
[]
[]
[]
[]
[]
[]
[]
[]
[]
[]
[]
[]
[]
[]
[]
[]
[]
[]
[]
[]
[]
[]
[]
[]
[]
[]
[]
[]
[]
[]
[]
[]
[]
[]
[]
[]
[]
[]
[]
[]
[]
[]
[]
[]
[]
[]
[]
[]
[]
[]
[]
[]
[]
[]
[]
[]
[]
[]
[]
[]
[]
[]
[]
[]
[]
[]
[]
[]
[]
[]
[]
[]
[]
[]
[]
[]
[]
[]
[]
[]
[]
[]
[]
[]
[]
[]
[]
[]
[]
[]
[]
[]
[]
[]
[]
[]
[]
[]
[]
[]
[]
[]
[]
[]
[]
[]
[]
[]
[]
[]
[]
[]
[]
[]
[]
[]
[]
[]
[]
[]
[]
[]
[]
[]
[]
[]
[]
[]
[]
[]
[]
[]
[]
[]
[]
[]
[]
[]
[]
[]
[]
[]
[]
[]
[]
[]
[]
[]
[]
[]
[]
[]
[]
[]
[]
[]
[]
[]
[]
[]
[]
[]
[]
[]
[]
[]
[]
[]
[]
[]
[]
[]
[]
[]
[]
[]
[]
[]
[]
[]
[]
[]
[]
[]
[]
[]
[]
[]
[]
[]
[]
[]
[]
[]
[]
[]
[]
[]
[]
[]
[]
[]
[]
[]
[]
[]
[]
[]
[]
[]
[]
[]
[]
[]
[]
[]
[]
[]
[]
[]
[]
[]
[]
[]
[]
[]
[]
[]
[]
[]
[]
[]
[]
[]
[]
[]
[]
[]
[]
[]
[]
[]
[]
[]
[]
[]
[]
[]
[]
[]
[]
[]
[]
[]
[]
[]
[]
[]
[]
[]
[]
[]
[]
[]
[]
[]
[]
[]
[]
[]
[]
[]
[]
[]
[]
[]
[]
[]
[]
[]
[]
[]
[]
[]
[]
[]
[]
[]
[]
[]
[]
[]
[]
[]
[]
[]
[]
[]
[]
[]
[]
[]
[]
[]
[]
[]
[]
[]
[]
[]
[]
[]
[]
[]
[]
[]
[]
[]
[]
[]
[]
[]
[]
[]
[]
[]
[]
[]
[]
[]
[]
[]
[]
[]
[]
[]
[]
[]
[]
[]
[]
[]
[]
[]
[]
[]
[]
[]
[]
[]
[]
[]
[]
[]
[]
[]
[]
[]
[]
[]
[]
[]
[]
[]
[]
[]
[]
[]
[]
[]
[]
[]
[]
[]
[]
[]
[]
[]
[]
[]
[]
[]
[]
[]
[]
[]
[]
[]
[]
[]
[]
[]
[]
[]
[]
[]
[]
[]
[]
[]
[]
[]
[]
[]
[]
[]
[]
[]
[]
[]
[]
[]
[]
[]
[]
[]
[]
[]
[]
[]
[]
[]
[]
[]
[]
[]
[]
[]
[]
[]
[]
[]
[]
[]
[]
[]
[]
[]
[]
[]
[]
[]
[]
[]
[]
[]
[]
[]
[]
[]
[]
[]
[]
[]
[]
[]
[]
[]
[]
[]
[]
[]
[]
[]
[]
[]
[]
[]
[]
[]
[]
[]
[]
[]
[]
[]
[]
[]
[]
[]
[]
[]
[]
[]
[]
[]
[]
[]
[]
[]
[]
[]
[]
[]
[]
[]
[]
[]
[]
[]
[]
[]
[]
[]
[]
[]
[]
[]
[]
[]
[]
[]
[]
[]
[]
[]
[]
[]
[]
[]
[]
[]
[]
[]
[]
[]
[]
[]
[]
[]
[]
[]
[]
[]
[]
[]
[]
[]
[]
[]
[]
[]
[]
[]
[]
[]
[]
[]
[]
[]
[]
[]
[]
[]
[]
[]
[]
[]
[]
[]
[]
[]
[]
[]
[]
[]
[]
[]
[]
[]
[]
[]
[]
[]
[]
[]
[]
[]
[]
[]
[]
[]
[]
[]
[]
[]
[]
[]
[]
[]
[]
[]
[]
[]
[]
[]
[]
[]
[]
[]
[]
[]
[]
[]
[]
[]
[]
[]
[]
[]
[]
[]
[]
[]
[]
[]
[]
[]
[]
[]
[]
[]
[]
[]
[]
[]
[]
[]
[]
[]
[]
[]
[]
[]
[]
[]
[]
[]
[]
[]
[]
[]
[]
[]
[]
[]
[]
[]
[]
[]
[]
[]
[]
[]
[]
[]
[]
[]
[]
[]
[]
[]
[]
[]
[]
[]
[]
[]
[]
[]
[]
[]
[]
[]
[]
[]
[]
[]
[]
[]
[]
[]
[]
[]
[]
[]
[]
[]
[]
[]
[]
[]
[]
[]
[]
[]
[]
[]
[]
[]
[]
[]
[]
[]
[]
[]
[]
[]
[]
[]
[]
[]
[]
[]
[]
[]
[]
[]
[]
[]
[]
[]
[]
[]
[]
[]
[]
[]
[]
[]
[]
[]
[]
[]
[]
[]
[]
[]
[]
[]
[]
[]
[]
[]
[]
[]
[]
[]
[]
[]
[]
[]
[]
[]
[]
[]
[]
[]
[]
[]
[]
[]
[]
[]
[]
[]
[]
[]
[]
[]
[]
[]
[]
[]
[]
[]
[]
[]
[]
[]
[]
[]
[]
[]
[]
[]
[]
[]
[]
[]
[]
[]
[]
[]
[]
[]
[]
[]
[]
[]
[]
[]
[]
[]
[]
[]
[]
[]
[]
[]
[]
[]
[]
[]
[]
[]
[]
[]
[]
[]
[]
[]
[]
[]
[]
[]
[]
[]
[]
[]
[]
[]
[]
[]
[]
[]
[]
[]
[]
[]
[]
[]
[]
[]
[]
[]
[]
[]
[]
[]
[]
[]
[]
[]
[]
[]
[]
[]
[]
[]
[]
[]
[]
[]
[]
[]
[]
[]
[]
[]
[]
[]
[]
[]
[]
[]
[]
[]
[]
[]
[]
[]
[]
[]
[]
[]
[]
[]
[]
[]
[]
[]
[]
[]
[]
[]
[]
[]
[]
[]
[]
[]
[]
[]
[]
[]
[]
[]
[]
[]
[]
[]
[]
[]
[]
[]
[]
[]
[]
[]
[]
[]
[]
[]
[]
[]
[]
[]
[]
[]
[]
[]
[]
[]
[]
[]
[]
[]
[]
[]
[]
[]
[]
[]
[]
[]
[]
[]
[]
[]
[]
[]
[]
[]
[]
[]
[]
[]
[]
[]
[]
[]
[]
[]
[]
[]
[]
[]
[]
[]
[]
[]
[]
[]
[]
[]
[]
[]
[]
[]
[]
[]
[]
[]
[]
[]
[]
[]
[]
[]
[]
[]
[]
[]
[]
[]
[]
[]
[]
[]
[]
[]
[]
[]
[]
[]
[]
[]
[]
[]
[]
[]
[]
[]
[]
[]
[]
[]
[]
[]
[]
[]
[]
[]
[]
[]
[]
[]
[]
[]
[]
[]
[]
[]
[]
[]
[]
[]
[]
[]
[]
[]
[]
[]
[]
[]
[]
[]
[]
[]
[]
[]
[]
[]
[]
[]
[]
[]
[]
[]
[]
[]
[]
[]
[]
[]
[]
[]
[]
[]
[]
[]
[]
[]
[]
[]
[]
[]
[]
[]
[]
[]
[]
[]
[]
[]
[]
[]
[]
[]
[]
[]
[]
[]
[]
[]
[]
[]
[]
[]
[]
[]
[]
[]
[]
[]
[]
[]
[]
[]
[]
[]
[]
[]
[]
[]
[]
[]
[]
[]
[]
[]
[]
[]
[]
[]
[]
[]
[]
[]
[]
[]
[]
[]
[]
[]
[]
[]
[]
[]
[]
[]
[]
[]
[]
[]
[]
[]
[]
[]
[]
[]
[]
[]
[]
[]
[]
[]
[]
[]
[]
[]
[]
[]
[]
[]
[]
[]
[]
[]
[]
[]
[]
[]
[]
[]
[]
[]
[]
[]
[]
[]
[]
[]
[]
[]
[]
[]
[]
[]
[]
[]
[]
[]
[]
[]
[]
[]
[]
[]
[]
[]
[]
[]
[]
[]
[]
[]
[]
[]
[]
[]
[]
[]
[]
[]
[]
[]
[]
[]
[]
[]
[]
[]
[]
[]
[]
[]
[]
[]
[]
[]
[]
[]
[]
[]
[]
[]
[]
[]
[]
[]
[]
[]
[]
[]
[]
[]
[]
[]
[]
[]
[]
[]
[]
[]
[]
[]
[]
[]
[]
[]
[]
[]
[]
[]
[]
[]
[]
[]
[]
[]
[]
[]
[]
[]
[]
[]
[]
[]
[]
[]
[]
[]
[]
[]
[]
[]
[]
[]
[]
[]
[]
[]
[]
[]
[]
[]
[]
[]
[]
[]
[]
[]
[]
[]
[]
[]
[]
[]
[]
[]
[]
[]
[]
[]
[]
[]
[]
[]
[]
[]
[]
[]
[]
[]
[]
[]
[]
[]
[]
[]
[]
[]
[]
[]
[]
[]
[]
[]
[]
[]
[]
[]
[]
[]
[]
[]
[]
[]
[]
[]
[]
[]
[]
[]
[]
[]
[]
[]
[]
[]
[]
[]
[]
[]
[]
[]
[]
[]
[]
[]
[]
[]
[]
[]
[]
[]
[]
[]
[]
[]
[]
[]
[]
[]
[]
[]
[]
[]
[]
[]
[]
[]
[]
[]
[]
[]
[]
[]
[]
[]
[]
[]
[]
[]
[]
[]
[]
[]
[]
[]
[]
[]
[]
[]
[]
[]
[]
[]
[]
[]
[]
[]
[]
[]
[]
[]
[]
[]
[]
[]
[]
[]
[]
[]
[]
[]
[]
[]
[]
[]
[]
[]
[]
[]
[]
[]
[]
[]
[]
[]
[]
[]
[]
[]
[]
[]
[]
[]
[]
[]
[]
[]
[]
[]
[]
[]
[]
[]
[]
[]
[]
[]
[]
[]
[]
[]
[]
[]
[]
[]
[]
[]
[]
[]
[]
[]
[]
[]
[]
[]
[]
[]
[]
[]
[]
[]
[]
[]
[]
[]
[]
[]
[]
[]
[]
[]
[]
[]
[]
[]
[]
[]
[]
[]
[]
[]
[]
[]
[]
[]
[]
[]
[]
[]
[]
[]
[]
[]
[]
[]
[]
[]
[]
[]
[]
[]
[]
[]
[]
[]
[]
[]
[]
[]
[]
[]
[]
[]
[]
[]
[]
[]
[]
[]
[]
[]
[]
[]
[]
[]
[]
[]
[]
[]
[]
[]
[]
[]
[]
[]
[]
[]
[]
[]
[]
[]
[]
[]
[]
[]
[]
[]
[]
[]
[]
[]
[]
[]
[]
[]
[]
[]
[]
[]
[]
[]
[]
[]
[]
[]
[]
[]
[]
[]
[]
[]
[]
[]
[]
[]
[]
[]
[]
[]
[]
[]
[]
[]
[]
[]
[]
[]
[]
[]
[]
[]
[]
[]
[]
[]
[]
[]
[]
[]
[]
[]
[]
[]
[]
[]
[]
[]
[]
[]
[]
[]
[]
[]
[]
[]
[]
[]
[]
[]
[]
[]
[]
[]
[]
[]
[]
[]
[]
[]
[]
[]
[]
[]
[]
[]
[]
[]
[]
[]
[]
[]
[]
[]
[]
[]
[]
[]
[]
[]
[]
[]
[]
[]
[]
[]
[]
[]
[]
[]
[]
[]
[]
[]
[]
[]
[]
[]
[]
[]
[]
[]
[]
[]
[]
[]
[]
[]
[]
[]
[]
[]
[]
[]
[]
[]
[]
[]
[]
[]
[]
[]
[]
[]
[]
[]
[]
[]
[]
[]
[]
[]
[]
[]
[]
[]
[]
[]
[]
[]
[]
[]
[]
[]
[]
[]
[]
[]
[]
[]
[]
[]
[]
[]
[]
[]
[]
[]
[]
[]
[]
[]
[]
[]
[]
[]
[]
[]
[]
[]
[]
[]
[]
[]
[]
[]
[]
[]
[]
[]
[]
[]
[]
[]
[]
[]
[]
[]
[]
[]
[]
[]
[]
[]
[]
[]
[]
[]
[]
[]
[]
[]
[]
[]
[]
[]
[]
[]
[]
[]
[]
[]
[]
[]
[]
[]
[]
[]
[]
[]
[]
[]
[]
[]
[]
[]
[]
[]
[]
[]
[]
[]
[]
[]
[]
[]
[]
[]
[]
[]
[]
[]
[]
[]
[]
[]
[]
[]
[]
[]
[]
[]
[]
[]
[]
[]
[]
[]
[]
[]
[]
[]
[]
[]
[]
[]
[]
[]
[]
[]
[]
[]
[]
[]
[]
[]
[]
[]
[]
[]
[]
[]
[]
[]
[]
[]
[]
[]
[]
[]
[]
[]
[]
[]
[]
[]
[]
[]
[]
[]
[]
[]
[]
[]
[]
[]
[]
[]
[]
[]
[]
[]
[]
[]
[]
[]
[]
[]
[]
[]
[]
[]
[]
[]
[]
[]
[]
[]
[]
[]
[]
[]
[]
[]
[]
[]
[]
[]
[]
[]
[]
[]
[]
[]
[]
[]
[]
[]
[]
[]
[]
[]
[]
[]
[]
[]
[]
[]
[]
[]
[]
[]
[]
[]
[]
[]
[]
[]
[]
[]
[]
[]
[]
[]
[]
[]
[]
[]
[]
[]
[]
[]
[]
[]
[]
[]
[]
[]
[]
[]
[]
[]
[]
[]
[]
[]
[]
[]
[]
[]
[]
[]
[]
[]
[]
[]
[]
[]
[]
[]
[]
[]
[]
[]
[]
[]
[]
[]
[]
[]
[]
[]
[]
[]
[]
[]
[]
[]
[]
[]
[]
[]
[]
[]
[]
[]
[]
[]
[]
[]
[]
[]
[]
[]
[]
[]
[]
[]
[]
[]
[]
[]
[]
[]
[]
[]
[]
[]
[]
[]
[]
[]
[]
[]
[]
[]
[]
[]
[]
[]
[]
[]
[]
[]
[]
[]
[]
[]
[]
[]
[]
[]
[]
[]
[]
[]
[]
[]
[]
[]
[]
[]
[]
[]
[]
[]
[]
[]
[]
[]
[]
[]
[]
[]
[]
[]
[]
[]
[]
[]
[]
[]
[]
[]
[]
[]
[]
[]
[]
[]
[]
[]
[]
[]
[]
[]
[]
[]
[]
[]
[]
[]
[]
[]
[]
[]
[]
[]
[]
[]
[]
[]
[]
[]
[]
[]
[]
[]
[]
[]
[]
[]
[]
[]
[]
[]
[]
[]
[]
[]
[]
[]
[]
[]
[]
[]
[]
[]
[]
[]
[]
[]
[]
[]
[]
[]
[]
[]
[]
[]
[]
[]
[]
[]
[]
[]
[]
[]
[]
[]
[]
[]
[]
[]
[]
[]
[]
[]
[]
[]
[]
[]
[]
[]
[]
[]
[]
[]
[]
[]
[]
[]
[]
[]
[]
[]
[]
[]
[]
[]
[]
[]
[]
[]
[]
[]
[]
[]
[]
[]
[]
[]
[]
[]
[]
[]
[]
[]
[]
[]
[]
[]
[]
[]
[]
[]
[]
[]
[]
[]
[]
[]
[]
[]
[]
[]
[]
[]
[]
[]
[]
[]
[]
[]
[]
[]
[]
[]
[]
[]
[]
[]
[]
[]
[]
[]
[]
[]
[]
[]
[]
[]
[]
[]
[]
[]
[]
[]
[]
[]
[]
[]
[]
[]
[]
[]
[]
[]
[]
[]
[]
[]
[]
[]
[]
[]
[]
[]
[]
[]
[]
[]
[]
[]
[]
[]
[]
[]
[]
[]
[]
[]
[]
[]
[]
[]
[]
[]
[]
[]
[]
[]
[]
[]
[]
[]
[]
[]
[]
[]
[]
[]
[]
[]
[]
[]
[]
[]
[]
[]
[]
[]
[]
[]
[]
[]
[]
[]
[]
[]
[]
[]
[]
[]
[]
[]
[]
[]
[]
[]
[]
[]
[]
[]
[]
[]
[]
[]
[]
[]
[]
[]
[]
[]
[]
[]
[]
[]
[]
[]
[]
[]
[]
[]
[]
[]
[]
[]
[]
[]
[]
[]
[]
[]
[]
[]
[]
[]
[]
[]
[]
[]
[]
[]
[]
[]
[]
[]
[]
[]
[]
[]
[]
[]
[]
[]
[]
[]
[]
[]
[]
[]
[]
[]
[]
[]
[]
[]
[]
[]
[]
[]
[]
[]
[]
[]
[]
[]
[]
[]
[]
[]
[]
[]
[]
[]
[]
[]
[]
[]
[]
[]
[]
[]
[]
[]
[]
[]
[]
[]
[]
[]
[]
[]
[]
[]
[]
[]
[]
[]
[]
[]
[]
[]
[]
[]
[]
[]
[]
[]
[]
[]
[]
[]
[]
[]
[]
[]
[]
[]
[]
[]
[]
[]
[]
[]
[]
[]
[]
[]
[]
[]
[]
[]
[]
[]
[]
[]
[]
[]
[]
[]
[]
[]
[]
[]
[]
[]
[]
[]
[]
[]
[]
[]
[]
[]
[]
[]
[]
[]
[]
[]
[]
[]
[]
[]
[]
[]
[]
[]
[]
[]
[]
[]
[]
[]
[]
[]
[]
[]
[]
[]
[]
[]
[]
[]
[]
[]
[]
[]
[]
[]
[]
[]
[]
[]
[]
[]
[]
[]
[]
[]
[]
[]
[]
[]
[]
[]
[]
[]
[]
[]
[]
[]
[]
[]
[]
[]
[]
[]
[]
[]
[]
[]
[]
[]
[]
[]
[]
[]
[]
[]
[]
[]
[]
[]
[]
[]
[]
[]
[]
[]
[]
[]
[]
[]
[]
[]
[]
[]
[]
[]
[]
[]
[]
[]
[]
[]
[]
[]
[]
[]
[]
[]
[]
[]
[]
[]
[]
[]
[]
[]
[]
[]
[]
[]
[]
[]
[]
[]
[]
[]
[]
[]
[]
[]
[]
[]
[]
[]
[]
[]
[]
[]
[]
[]
[]
[]
[]
[]
[]
[]
[]
[]
[]
[]
[]
[]
[]
[]
[]
[]
[]
[]
[]
[]
[]
[]
[]
[]
[]
[]
[]
[]
[]
[]
[]
[]
[]
[]
[]
[]
[]
[]
[]
[]
[]
[]
[]
[]
[]
[]
[]
[]
[]
[]
[]
[]
[]
[]
[]
[]
[]
[]
[]
[]
[]
[]
[]
[]
[]
[]
[]
[]
[]
[]
[]
[]
[]
[]
[]
[]
[]
[]
[]
[]
[]
[]
[]
[]
[]
[]
[]
[]
[]
[]
[]
[]
[]
[]
[]
[]
[]
[]
[]
[]
[]
[]
[]
[]
[]
[]
[]
[]
[]
[]
[]
[]
[]
[]
[]
[]
[]
[]
[]
[]
[]
[]
[]
[]
[]
[]
[]
[]
[]
[]
[]
[]
[]
[]
[]
[]
[]
[]
[]
[]
[]
[]
[]
[]
[]
[]
[]
[]
[]
[]
[]
[]
[]
[]
[]
[]
[]
[]
[]
[]
[]
[]
[]
[]
[]
[]
[]
[]
[]
[]
[]
[]
[]
[]
[null,null,null,true]
[]
[]
[]
[]
[]
[]
[]
[]
[]
[]
[]
[]
[]
[]
[]
[]
[]
[]
[]
[]
[]
[]
[]
[]
[]
[]
[]
[]
[]
[]
[]
[]
[]
[]
[]
[]
[]
[]
[]
[]
[]
[]
[]
[]
[]
[]
[]
[]
[]
[]
[]
[]
[]
[]
[]
[]
[]
[]
[]
[]
[]
[]
[]
[]
[]
[]
[]
[]
[]
[]
[]
[]
[]
[]
[]
[]
[]
[]
[]
[]
[]
[]
[]
[]
[]
[]
[]
[]
[]
[]
[]
[]
[]
[]
[]
[]
[]
[]
[]
[]
[]
[]
[]
[]
[]
[]
[]
[]
[]
[]
[]
[]
[]
[]
[]
[]
[]
[]
[]
[]
[]
[]
[]
[]
[]
[]
[]
[]
[]
[]
[]
[]
[]
[]
[]
[]
[]
[]
[]
[]
[]
[]
[]
[]
[]
[]
[]
[]
[]
[]
[]
[]
[]
[]
[]
[]
[]
[]
[]
[]
[]
[]
[]
[]
[]
[]
[]
[]
[]
[]
[]
[]
[]
[]
[]
[]
[]
[]
[]
[]
[]
[]
[]
[]
[]
[]
[]
[]
[]
[]
[]
[]
[]
[]
[]
[]
[]
[]
[]
[]
[]
[]
[]
[]
[]
[]
[]
[]
[]
[]
[]
[]
[]
[]
[]
[]
[]
[]
[]
[]
[]
[]
[]
[]
[]
[]
[]
[]
[]
[]
[]
[]
[]
[]
[]
[]
[]
[]
[]
[]
[]
[]
[]
[]
[]
[]
[]
[]
[]
[]
[]
[]
[]
[]
[]
[]
[]
[]
[]
[]
[]
[]
[]
[]
[]
[]
[]
[]
[]
[]
[]
[]
[]
[]
[]
[]
[]
[]
[]
[]
[]
[]
[]
[]
[]
[]
[]
[]
[]
[]
[]
[]
[]
[]
[]
[]
[]
[]
[]
[]
[]
[]
[]
[]
[]
[]
[]
[]
[]
[]
[]
[]
[]
[]
[]
[]
[]
[]
[]
[]
[]
[]
[]
[]
[]
[]
[]
[]
[]
[]
[]
[]
[]
[]
[]
[]
[]
[]
[]
[]
[]
[]
[]
[]
[]
[]
[]
[]
[]
[]
[]
[]
[]
[]
[]
[]
[]
[]
[]
[]
[]
[]
[]
[]
[]
[]
[]
[]
[]
[]
[]
[]
[]
[]
[]
[]
[]
[]
[]
[]
[]
[]
[]
[]
[]
[]
[]
[]
[]
[]
[]
[]
[]
[]
[]
[]
[]
[]
[]
[]
[]
[]
[]
[]
[]
[]
[]
[]
[]
[]
[]
[]
[]
[]
[]
[]
[]
[]
[]
[]
[]
[]
[]
[]
[]
[]
[]
[]
[]
[]
[]
[]
[]
[]
[]
[]
[]
[]
[]
[]
[]
[]
[]
[]
[]
[]
[]
[]
[]
[]
[]
[]
[]
[]
[]
[]
[]
[]
[]
[]
[]
[]
[]
[]
[]
[]
[]
[]
[]
[]
[]
[]
[]
[]
[]
[]
[]
[]
[]
[]
[]
[]
[]
[]
[]
[]
[]
[]
[]
[]
[]
[]
[]
[]
[]
[]
[]
[]
[]
[]
[]
[]
[]
[]
[null,null,null,null,null,null,null,null,null,null,null,null,null,false]

{"sheet":"일정","index":3,"n_rows":371,"n_cols":14,"rows_kept":371,"cut":false,"hidden":false,"merged":[[3,0,3,12],[4,0,4,12]]}
[]
[null,null,null,null,null,null,null,null,null,null,null,null,"범례","중요"]
[null,null,null,null,null,null,null,null,null,null,null,null,null,"업무"]
["질문 1: 예제 파일 시트에 \"개별운동\" 단어가 있으면 일정 시트에 동일 날짜 C열에는 \"○ 개별운동\" D 열에는 \"중요\"를 자동으로 넣는 함수 있을 까요??",null,null,null,null,null,null,null,null,null,null,null,null,"개인"]
["질문 2 : M열에 개별운동 횟수를 자동으로 나타나게 할 수 있는 함수는요?",null,null,null,null,null,null,null,null,null,null,null,null,"기타"]
[null,"날짜","일정1 내용","일정1 범례","일정2 내용","일정2 범례","일정3 내용","일정3 범례","일정4 내용","일정4 범례","일정5 내용","일정5 범례","개별운동 횟수?"]
[null,{"$f":"DATE(연간!$O$2,연간!$E$4,1)","v":"2022-01-01"}]
[null,{"$f":"B7+1","v":"2022-01-02"}]
[null,{"$f":"B8+1","v":"2022-01-03"}]
[null,"2022-01-04"]
[null,"2022-01-05"]
[null,"2022-01-06"]
[null,"2022-01-07"]
[null,"2022-01-08"]
[null,"2022-01-09"]
[null,"2022-01-10"]
[null,"2022-01-11"]
[null,"2022-01-12"]
[null,"2022-01-13"]
[null,"2022-01-14"]
[null,"2022-01-15"]
[null,"2022-01-16"]
[null,"2022-01-17","○ 개별운동","중요"]
[null,"2022-01-18"]
[null,"2022-01-19"]
[null,"2022-01-20","○ 개별운동","중요"]
[null,"2022-01-21"]
[null,"2022-01-22"]
[null,"2022-01-23"]
[null,"2022-01-24","○ 개별운동","중요"]
[null,"2022-01-25"]
[null,"2022-01-26"]
[null,"2022-01-27"]
[null,"2022-01-28"]
[null,"2022-01-29"]
[null,"2022-01-30"]
[null,"2022-01-31"]
[null,"2022-02-01"]
[null,"2022-02-02"]
[null,"2022-02-03"]
[null,"2022-02-04"]
[null,"2022-02-05"]
[null,"2022-02-06"]
[null,"2022-02-07"]
[null,"2022-02-08"]
[null,"2022-02-09"]
[null,"2022-02-10"]
[null,"2022-02-11"]
[null,"2022-02-12"]
[null,"2022-02-13"]
[null,"2022-02-14"]
[null,"2022-02-15"]
[null,"2022-02-16"]
[null,"2022-02-17"]
[null,"2022-02-18"]
[null,"2022-02-19"]
[null,"2022-02-20"]
[null,"2022-02-21"]
[null,"2022-02-22"]
[null,"2022-02-23"]
[null,"2022-02-24"]
[null,"2022-02-25"]
[null,"2022-02-26"]
[null,"2022-02-27"]
[null,"2022-02-28"]
[null,"2022-03-01"]
[null,"2022-03-02"]
[null,"2022-03-03"]
[null,"2022-03-04"]
[null,"2022-03-05"]
[null,"2022-03-06"]
[null,"2022-03-07"]
[null,{"$f":"B72+1","v":"2022-03-08"}]
[null,"2022-03-09"]
[null,"2022-03-10"]
[null,"2022-03-11"]
[null,"2022-03-12"]
[null,"2022-03-13"]
[null,"2022-03-14"]
[null,"2022-03-15"]
[null,"2022-03-16"]
[null,"2022-03-17"]
[null,"2022-03-18"]
[null,"2022-03-19"]
[null,"2022-03-20"]
[null,"2022-03-21"]
[null,"2022-03-22"]
[null,"2022-03-23"]
[null,"2022-03-24"]
[null,"2022-03-25"]
[null,"2022-03-26"]
[null,"2022-03-27"]
[null,"2022-03-28"]
[null,"2022-03-29"]
[null,"2022-03-30"]
[null,"2022-03-31"]
[null,"2022-04-01"]
[null,"2022-04-02"]
[null,"2022-04-03"]
[null,"2022-04-04"]
[null,"2022-04-05"]
[null,"2022-04-06"]
[null,"2022-04-07"]
[null,"2022-04-08"]
[null,"2022-04-09"]
[null,"2022-04-10"]
[null,"2022-04-11"]
[null,"2022-04-12"]
[null,"2022-04-13"]
[null,"2022-04-14"]
[null,"2022-04-15"]
[null,"2022-04-16"]
[null,"2022-04-17"]
[null,"2022-04-18"]
[null,"2022-04-19"]
[null,"2022-04-20"]
[null,"2022-04-21"]
[null,"2022-04-22"]
[null,"2022-04-23"]
[null,"2022-04-24"]
[null,"2022-04-25"]
[null,"2022-04-26"]
[null,"2022-04-27"]
[null,"2022-04-28"]
[null,"2022-04-29"]
[null,"2022-04-30"]
[null,"2022-05-01"]
[null,"2022-05-02"]
[null,"2022-05-03"]
[null,"2022-05-04"]
[null,"2022-05-05"]
[null,"2022-05-06"]
[null,"2022-05-07"]
[null,"2022-05-08"]
[null,"2022-05-09"]
[null,"2022-05-10"]
[null,{"$f":"B136+1","v":"2022-05-11"}]
[null,"2022-05-12"]
[null,"2022-05-13"]
[null,"2022-05-14"]
[null,"2022-05-15"]
[null,"2022-05-16"]
[null,"2022-05-17"]
[null,"2022-05-18"]
[null,"2022-05-19"]
[null,"2022-05-20"]
[null,"2022-05-21"]
[null,"2022-05-22"]
[null,"2022-05-23"]
[null,"2022-05-24"]
[null,"2022-05-25"]
[null,"2022-05-26"]
[null,"2022-05-27"]
[null,"2022-05-28"]
[null,"2022-05-29"]
[null,"2022-05-30"]
[null,"2022-05-31"]
[null,"2022-06-01"]
[null,"2022-06-02"]
[null,"2022-06-03"]
[null,"2022-06-04"]
[null,"2022-06-05"]
[null,"2022-06-06"]
[null,"2022-06-07"]
[null,"2022-06-08"]
[null,"2022-06-09"]
[null,"2022-06-10"]
[null,"2022-06-11"]
[null,"2022-06-12"]
[null,"2022-06-13"]
[null,"2022-06-14"]
[null,"2022-06-15"]
[null,"2022-06-16"]
[null,"2022-06-17"]
[null,"2022-06-18"]
[null,"2022-06-19"]
[null,"2022-06-20"]
[null,"2022-06-21"]
[null,"2022-06-22"]
[null,"2022-06-23"]
[null,"2022-06-24"]
[null,"2022-06-25"]
[null,"2022-06-26"]
[null,"2022-06-27"]
[null,"2022-06-28"]
[null,"2022-06-29"]
[null,"2022-06-30"]
[null,"2022-07-01"]
[null,"2022-07-02"]
[null,"2022-07-03"]
[null,"2022-07-04"]
[null,"2022-07-05"]
[null,"2022-07-06"]
[null,"2022-07-07"]
[null,"2022-07-08"]
[null,"2022-07-09"]
[null,"2022-07-10"]
[null,"2022-07-11"]
[null,"2022-07-12"]
[null,"2022-07-13"]
[null,{"$f":"B200+1","v":"2022-07-14"}]
[null,"2022-07-15"]
[null,"2022-07-16"]
[null,"2022-07-17"]
[null,"2022-07-18"]
[null,"2022-07-19"]
[null,"2022-07-20"]
[null,"2022-07-21"]
[null,"2022-07-22"]
[null,"2022-07-23"]
[null,"2022-07-24"]
[null,"2022-07-25"]
[null,"2022-07-26"]
[null,"2022-07-27"]
[null,"2022-07-28"]
[null,"2022-07-29"]
[null,"2022-07-30"]
[null,"2022-07-31"]
[null,"2022-08-01"]
[null,"2022-08-02"]
[null,"2022-08-03"]
[null,"2022-08-04"]
[null,"2022-08-05"]
[null,"2022-08-06"]
[null,"2022-08-07"]
[null,"2022-08-08"]
[null,"2022-08-09"]
[null,"2022-08-10"]
[null,"2022-08-11"]
[null,"2022-08-12"]
[null,"2022-08-13"]
[null,"2022-08-14"]
[null,"2022-08-15"]
[null,"2022-08-16"]
[null,"2022-08-17"]
[null,"2022-08-18"]
[null,"2022-08-19"]
[null,"2022-08-20"]
[null,"2022-08-21"]
[null,"2022-08-22"]
[null,"2022-08-23"]
[null,"2022-08-24"]
[null,"2022-08-25"]
[null,"2022-08-26"]
[null,"2022-08-27"]
[null,"2022-08-28"]
[null,"2022-08-29"]
[null,"2022-08-30"]
[null,"2022-08-31"]
[null,"2022-09-01"]
[null,"2022-09-02"]
[null,"2022-09-03"]
[null,"2022-09-04"]
[null,"2022-09-05"]
[null,"2022-09-06"]
[null,"2022-09-07"]
[null,"2022-09-08"]
[null,"2022-09-09"]
[null,"2022-09-10"]
[null,"2022-09-11"]
[null,"2022-09-12"]
[null,"2022-09-13"]
[null,"2022-09-14"]
[null,"2022-09-15"]
[null,{"$f":"B264+1","v":"2022-09-16"}]
[null,"2022-09-17"]
[null,"2022-09-18"]
[null,"2022-09-19"]
[null,"2022-09-20"]
[null,"2022-09-21"]
[null,"2022-09-22"]
[null,"2022-09-23"]
[null,"2022-09-24"]
[null,"2022-09-25"]
[null,"2022-09-26"]
[null,"2022-09-27"]
[null,"2022-09-28"]
[null,"2022-09-29"]
[null,"2022-09-30"]
[null,"2022-10-01"]
[null,"2022-10-02"]
[null,"2022-10-03"]
[null,"2022-10-04"]
[null,"2022-10-05"]
[null,"2022-10-06"]
[null,"2022-10-07"]
[null,"2022-10-08"]
[null,"2022-10-09"]
[null,"2022-10-10"]
[null,"2022-10-11"]
[null,"2022-10-12"]
[null,"2022-10-13"]
[null,"2022-10-14"]
[null,"2022-10-15"]
[null,"2022-10-16"]
[null,"2022-10-17"]
[null,"2022-10-18"]
[null,"2022-10-19"]
[null,"2022-10-20"]
[null,"2022-10-21"]
[null,"2022-10-22"]
[null,"2022-10-23"]
[null,"2022-10-24"]
[null,"2022-10-25"]
[null,"2022-10-26"]
[null,"2022-10-27"]
[null,"2022-10-28"]
[null,"2022-10-29"]
[null,"2022-10-30"]
[null,"2022-10-31"]
[null,"2022-11-01"]
[null,"2022-11-02"]
[null,"2022-11-03"]
[null,"2022-11-04"]
[null,"2022-11-05"]
[null,"2022-11-06"]
[null,"2022-11-07"]
[null,"2022-11-08"]
[null,"2022-11-09"]
[null,"2022-11-10"]
[null,"2022-11-11"]
[null,"2022-11-12"]
[null,"2022-11-13"]
[null,"2022-11-14"]
[null,"2022-11-15"]
[null,"2022-11-16"]
[null,"2022-11-17"]
[null,"2022-11-18"]
[null,{"$f":"B328+1","v":"2022-11-19"}]
[null,"2022-11-20"]
[null,"2022-11-21"]
[null,"2022-11-22"]
[null,"2022-11-23"]
[null,"2022-11-24"]
[null,"2022-11-25"]
[null,"2022-11-26"]
[null,"2022-11-27"]
[null,"2022-11-28"]
[null,"2022-11-29"]
[null,"2022-11-30"]
[null,"2022-12-01"]
[null,"2022-12-02"]
[null,"2022-12-03"]
[null,"2022-12-04"]
[null,"2022-12-05"]
[null,"2022-12-06"]
[null,"2022-12-07"]
[null,"2022-12-08"]
[null,"2022-12-09"]
[null,"2022-12-10"]
[null,"2022-12-11"]
[null,"2022-12-12"]
[null,"2022-12-13"]
[null,"2022-12-14"]
[null,"2022-12-15"]
[null,"2022-12-16"]
[null,"2022-12-17"]
[null,"2022-12-18"]
[null,"2022-12-19"]
[null,"2022-12-20"]
[null,"2022-12-21"]
[null,"2022-12-22"]
[null,"2022-12-23"]
[null,"2022-12-24"]
[null,"2022-12-25"]
[null,"2022-12-26"]
[null,"2022-12-27"]
[null,"2022-12-28"]
[null,"2022-12-29"]
[null,"2022-12-30"]
[null,"2022-12-31"]

{"sheet":"공휴일","index":4,"n_rows":29,"n_cols":6,"rows_kept":29,"cut":false,"hidden":false,"merged":[[0,4,0,5],[0,2,0,3]]}
["월","일","공휴일",null,"기념일"]
[{"$f":"IF(C2=\"\",\"\",MONTH(C2))","v":1},{"$f":"IF(C2=\"\",\"\",DAY(C2))","v":1},{"$f":"DATE(연간!$O$2,1,1)","v":"2022-01-01"},"신정",{"$f":"DATE(연간!$O$2,11,8)","v":"2022-11-08"},"기념일 예시"]
[{"$f":"IF(C3=\"\",\"\",MONTH(C3))","v":1},{"$f":"IF(C3=\"\",\"\",DAY(C3))","v":31},{"$f":"INDEX(날짜,MATCH(연간!$O$2,공휴일연도,0),0)","v":"2022-01-31"},"설날"]
[2,1,{"$f":"C3+1","v":"2022-02-01"},"설날"]
[2,2,{"$f":"C4+1","v":"2022-02-02"},"설날"]
[3,1,{"$f":"DATE(연간!$O$2,3,1)","v":"2022-03-01"},"삼일절"]
[5,5,{"$f":"DATE(연간!$O$2,5,5)","v":"2022-05-05"},"어린이날"]
[5,8,{"$f":"INDEX(날짜,MATCH(1,($D$8=휴일명)*(연간!$O$2=공휴일연도),0))","v":"2022-05-08"},"석가탄신일"]
[6,6,{"$f":"DATE(연간!$O$2,6,6)","v":"2022-06-06"},"현충일"]
[8,15,{"$f":"DATE(연간!$O$2,8,15)","v":"2022-08-15"},"광복절"]
[9,9,{"$f":"INDEX(날짜,MATCH(1,($D$11=휴일명)*(연간!$O$2=공휴일연도),0))","v":"2022-09-09"},"추석"]
[9,10,{"$f":"C11+1","v":"2022-09-10"},"추석"]
[9,11,{"$f":"C12+1","v":"2022-09-11"},"추석"]
[10,3,{"$f":"DATE(연간!$O$2,10,3)","v":"2022-10-03"},"개천절"]
[10,9,{"$f":"DATE(연간!$O$2,10,9)","v":"2022-10-09"},"한글날"]
[12,25,{"$f":"DATE(연간!$O$2,12,25)","v":"2022-12-25"},"성탄절"]
[3,9,"2022-03-09","20대 대통령 선거"]
[6,1,"2022-06-01","지방선거"]
[9,12,"2022-09-12","추석 대체휴일"]
[10,10,"2022-10-10","한글날 대체휴일"]
["",""]
["",""]
["",""]
["",""]
["",""]
["",""]
["",""]
["",""]
["",""]

{"sheet":"디데이","index":5,"n_rows":12,"n_cols":6,"rows_kept":12,"cut":false,"hidden":false,"merged":[]}
[]
[null,"디데이 내용 입력",null,null,{"$f":"IF(C2=\"\",\"\",\"📆 \"&C2)","v":""},{"$f":"IF(C4=\"\",\"\",C5)","v":""}]
[null,"오늘 날짜",{"$f":"TODAY()","v":"2022-10-03"}]
[null,"기준일 입력"]
[null,"D-day",{"$f":"IF(C4-C3<0,\"D+\"&ABS(C4-C3),\"D-\"&C4-C3)","v":"D+44837"}]
[]
[null,"디데이 내용 입력",null,null,{"$f":"IF(C7=\"\",\"\",\"📆 \"&C7)","v":""},{"$f":"IF(C9=\"\",\"\",C10)","v":""}]
[null,"오늘 날짜",{"$f":"TODAY()","v":"2022-10-03"}]
[null,"기준일 입력"]
[null,"D-day",{"$f":"IF(C9-C8<0,\"D+\"&ABS(C9-C8),\"D-\"&C9-C8)","v":"D+44837"}]
[]
[null,"*노란색 셀 배경이 채워져있는 곳만 수정하세요!"]

{"sheet":"예제 파일","index":6,"n_rows":224,"n_cols":3,"rows_kept":224,"cut":false,"hidden":false,"merged":[]}
["구분","일자","내용"]
["개인관찰기록지","2022-01-17","○ 개별운동\n   0 장소 : 4호실\n   0 내용 : 스트레칭 밴드 운동, 소도구 활용 운동\n   \n   - 스트레칭 밴드가 끊어져 사용할 수 없어 노란색 밴드를\n     인터넷으로 주문했다고 함\n\n   - 작년과 운동방법은 동일하지만 횟수를 10회에서 15회로 늘려\n     3세트 운동할 수 있도록 지원하겠다고 안내함\n\n   - 소도구 활용 운동방법으로 손에 악력이 약해 아력운동을\n     할 수 있도록 스펀지 공으로 주먹쥐기 운동을 상의하여 \n     스펀지 공 악력운동할 수 있도록 마술용 스펀지 공을 구입함"]
["개인관찰기록지","2022-01-20","○ 개별운동\n   0 장소 : 4호실\n   0 내용 : 스트레칭 밴드 운동\n   \n   - 운동 설명\n     1단계 몸풀기로 양팔을 위, 아래로 들었다가 내리며 15회씩\n     3세트함\n\n     2단계 침대 발 받침에 묶은 스트레칭 밴드를 15회씩 3세트 당기는\n     운동을 진행함\n\n     3단계 왼쪽 다리 올렸다 내리기 15회씩 3세트 운동 진행함\n\n    - 오랜만에 운동해서 너무 힘들다고 함\n \n    - 특히 왼쪽 다리 힘이 약해져 다리 올릴 때 너무 무겁게\n      느껴진다고 함"]
["개인관찰기록지","2022-01-24","○ 개별운동\n   0 장소 : 4호실\n   0 내용 : 스트레칭 밴드 운동, 소도구 활용 운동\n   \n   - 운동 설명\n     1단계 몸풀기로 양팔을 위, 아래로 들었다가 내리며 15회씩\n     3세트함\n\n     2단계 침대 발 받침에 묶은 스트레칭 밴드를 15회씩 3세트 당기는\n     운동을 진행함\n\n     3단계 왼쪽 다리 올렸다 내리기 15회씩 3세트 운동 진행함\n\n   - 3세트 12회 당겼을 때 힘이 빠져 너무 힘들다며 포기를 선언함\n\n   - 스펀지 공으로 악력운동을 지원한 결과 왼손은 마우스 등을 사용해서\n     8회할 수 있으며, 오른손은 3회 약력운동을 함"]
["개인관찰기록지","2022-01-27","○ 개별운동\n   0 장소 : 4호실\n   0 내용 : 스트레칭 밴드 운동\n   \n   - 운동 설명\n     1단계 몸풀기로 양팔을 위, 아래로 들었다가 내리며 15회씩\n     3세트함\n\n     2단계 침대 발 받침에 묶은 스트레칭 밴드를 15회씩 3세트 당기는\n     운동을 진행함\n\n     3단계 왼쪽 다리 올렸다 내리기 15회씩 3세트 운동 진행함\n\n    - TV에 나오는 보치아 경기를 보면서 팔에 힘을 길러\n      보치아 대회 우승해 보고 싶다고 얘기함"]
["개인관찰기록지","2022-01-31","○ 개별운동\n   0 장소 : 4호실\n   0 내용 : 스트레칭 밴드 운동\n   \n   - 운동 설명\n     1단계 몸풀기로 양팔을 위, 아래로 들었다가 내리며 15회씩\n     3세트함\n\n     2단계 침대 발 받침에 묶은 스트레칭 밴드를 15회씩 3세트 당기는\n     운동을 진행함\n\n     3단계 왼쪽 다리 올렸다 내리기 15회씩 3세트 운동 진행함\n\n   - 전보다 힘들지는 않지만 그래도 3세트 13회에서 포기하고\n     싶은 고비가 온다고 함"]
["개인관찰기록지","2022-02-04","○ 개별운동\n   0 장소 : 4호실\n   0 내용 : 스트레칭 밴드 운동, 소도구 활용 운동\n   \n   - 운동 설명\n     1단계 몸풀기로 양팔을 위, 아래로 들었다가 내리며 15회씩\n     3세트함\n\n     2단계 침대 발 받침에 묶은 스트레칭 밴드를 15회씩 3세트 당기는\n     운동을 진행함\n\n     3단계 왼쪽 다리 올렸다 내리기 15회씩 3세트 운동 진행함\n\n   - 3세트 13회를 계속 넘기지 못해 아쉽기도 하고 욕심이 생긴다고 함\n\n   - 스펀지볼을 활용한 악력 운동 결과 왼손으로는 8회, 오른손 3회함"]
["개인관찰기록지","2022-02-07","○ 개별운동\n   0 장소 : 4호실\n   0 내용 : 스트레칭 밴드 운동\n   \n   - 운동 설명\n     1단계 몸풀기로 양팔을 위, 아래로 들었다가 내리며 15회씩\n     3세트함\n\n     2단계 침대 발 받침에 묶은 스트레칭 밴드를 15회씩 3세트 당기는\n     운동을 진행함\n\n     3단계 왼쪽 다리 올렸다 내리기 15회씩 3세트 운동 진행함\n\n   - 3세트 13회를 넘겨 14회까지 완료함\n\n   - 목표까지 1회 남았다며 좋아함"]
["개인관찰기록지","2022-02-10","○ 개별운동\n   0 장소 : 4호실\n   0 내용 : 스트레칭 밴드 운동, 소도구 활용 운동\n   \n   - 운동 설명\n     1단계 몸풀기로 양팔을 위, 아래로 들었다가 내리며 15회씩\n     3세트함\n\n     2단계 침대 발 받침에 묶은 스트레칭 밴드를 15회씩 3세트 당기는\n     운동을 진행함\n\n     3단계 왼쪽 다리 올렸다 내리기 15회씩 3세트 운동 진행함\n\n   - 컨디션이 좋지 않다고 하여 2세트 10회하고 종료함\n\n   - 스펀지볼을 활용한 악력 운동 결과 왼손으로는 8회, 오른손 3회함"]
["개인관찰기록지","2022-02-15","○ 개별운동\n   0 장소 : 4호실\n   0 내용 : 스트레칭 밴드 운동\n   \n   - 운동 설명\n     1단계 몸풀기로 양팔을 위, 아래로 들었다가 내리며 15회씩\n     3세트함\n\n     2단계 침대 발 받침에 묶은 스트레칭 밴드를 15회씩 3세트 당기는\n     운동을 진행함\n\n     3단계 왼쪽 다리 올렸다 내리기 15회씩 3세트 운동 진행함\n\n   - 전보다 팔에 힘이 생긴 것 같다며 좋아함"]
["개인관찰기록지","2022-02-17","○ 개별운동\n   0 장소 : 4호실\n   0 내용 : 스트레칭 밴드 운동, 소도구 활용 운동\n   \n   - 운동 설명\n     1단계 몸풀기로 양팔을 위, 아래로 들었다가 내리며 15회씩\n     3세트함\n\n     2단계 침대 발 받침에 묶은 스트레칭 밴드를 15회씩 3세트 당기는\n     운동을 진행함\n\n     3단계 왼쪽 다리 올렸다 내리기 15회씩 3세트 운동 진행함\n\n   - 운동 시간이 끝나도 최선을 다해서 열정적으로 운동함\n\n   - 스펀지볼을 활용한 악력 운동 결과 왼손으로는 8회, 오른손 3회함"]
["개인관찰기록지","2022-02-21","○ 개별운동\n   0 장소 : 4호실\n   0 내용 : 스트레칭 밴드 운동\n   \n   - 운동 설명\n     1단계 몸풀기로 양팔을 위, 아래로 들었다가 내리며 15회씩\n     3세트함\n\n     2단계 침대 발 받침에 묶은 스트레칭 밴드를 15회씩 3세트 당기는\n     운동을 진행함\n\n     3단계 왼쪽 다리 올렸다 내리기 15회씩 3세트 운동 진행함\n\n   - 보치아 우승에 대한 의지가 강해 직원이 없어도 얼심히 운동함"]
["개인관찰기록지","2022-02-24","○ 개별운동\n   0 장소 : 4호실\n   0 내용 : 스트레칭 밴드 운동, 소도구 활용 운동\n   \n   - 운동 설명\n     1단계 몸풀기로 양팔을 위, 아래로 들었다가 내리며 15회씩\n     3세트함\n\n     2단계 침대 발 받침에 묶은 스트레칭 밴드를 15회씩 3세트 당기는\n     운동을 진행함\n\n     3단계 왼쪽 다리 올렸다 내리기 15회씩 3세트 운동 진행함\n\n   - 스트레칭 밴드가 너무 잘 늘어나 강도의 1단계 높은 밴드를 인터넷\n     쇼핑몰로 구입했다고 함\n\n   - 스펀지볼을 활용한 악력 운동 결과 왼손으로는 8회, 오른손 3회함"]
["개인관찰기록지","2022-02-28","○ 개별운동\n   0 장소 : 4호실\n   0 내용 : 스트레칭 밴드 운동\n   \n   - 운동 설명\n     1단계 몸풀기로 양팔을 위, 아래로 들었다가 내리며 15회씩\n     3세트함\n\n     2단계 침대 발 받침에 묶은 스트레칭 밴드를 15회씩 3세트 당기는\n     운동을 진행함\n\n     3단계 왼쪽 다리 올렸다 내리기 15회씩 3세트 운동 진행함\n\n   - 스트레칭 밴드 15회 3세트 처음으로 완료해 너무 좋다고 함"]
["개인관찰기록지","2022-03-03","○ 개별운동\n   0 장소 : 4호실\n   0 내용 : 스트레칭 밴드 운동, 소도구 활용 운동\n   \n   - 운동 내용\n     1단계 몸풀기로 양팔을 위, 아래로 들었다가 내리며 15회씩\n     3세트함\n\n     2단계 침대에 묶은 스트레칭 밴드를 15회씩 3세트 당기는\n     운동을 진행함\n\n   - 3세트를 달성을 힘들어 하였지만, 끝까지 15회 3세트 완료함\n\n   - 스펀지볼을 활용한 악력 운동 결과 왼손으로는 8회, 오른손 3회함"]
["개인관찰기록지","2022-03-04","○ 개별운동\n   0 장소 : 4호실\n   0 내용 : 스트레칭 밴드 운동\n   \n   - 운동 내용\n     1단계 몸풀기로 양팔을 위, 아래로 들었다가 내리며 15회씩\n     3세트함\n\n     2단계 침대에 묶은 스트레칭 밴드를 15회씩 3세트 당기는\n     운동을 진행함\n\n   - 운동 후 팔에 힘이 생겨 침대에서 옆으로 누울때 힘들지 않게\n     되었다고 함"]
["개인관찰기록지","2022-03-09","○ 개별운동\n   0 장소 : 4호실\n   0 내용 : 스트레칭 밴드 운동, 소도구 활용 운동\n   \n   - 운동 내용\n     1단계 몸풀기로 양팔을 위, 아래로 들었다가 내리며 15회씩\n     3세트함\n\n     2단계 침대에 묶은 스트레칭 밴드를 15회씩 3세트 당기는\n     운동을 진행함\n\n   - 컨디션이 좋지 않아 2세트 13회부터 힘이 안들어가 3세트 10회에\n     그만하고 싶다고 해서 중지함\n\n   - 스펀지볼을 활용한 악력 운동 결과 왼손으로는 8회, 오른손 3회함"]
["개인관찰기록지","2022-03-10","○ 개별운동\n   0 장소 : 4호실\n   0 내용 : 스트레칭 밴드 운동\n   \n   - 운동 내용\n     1단계 몸풀기로 양팔을 위, 아래로 들었다가 내리며 15회씩\n     3세트함\n\n     2단계 침대에 묶은 스트레칭 밴드를 15회씩 3세트 당기는\n     운동을 진행함\n\n   - 컨디션이 좋지 않아 15회씩 2세트만 하고 중단함"]
["개인관찰기록지","2022-03-15","○ 개별운동\n   0 장소 : 4호실\n   0 내용 : 스트레칭 밴드 운동, 소도구 활용 운동\n   \n   - 운동 내용\n     1단계 몸풀기로 양팔을 위, 아래로 들었다가 내리며 15회씩\n     3세트함\n\n     2단계 침대에 묶은 스트레칭 밴드를 15회씩 3세트 당기는\n     운동을 진행함\n\n   - 직원이 챙기지 않아도 시간 맞춰서 운동을 시작함. 팔에\n     힘이 생겨 운동할때 힘든 것이 줄었다고 함\n\n   - 스펀지볼을 활용한 악력 운동 결과 왼손으로는 8회, 오른손 3회함"]
["개인관찰기록지","2022-03-16","○ 개별운동\n   0 장소 : 4호실\n   0 내용 : 스트레칭 밴드 운동\n\n   - 운동 내용\n     1단계 몸풀기로 양팔을 위, 아래로 들었다가 내리며 15회씩\n     3세트함\n\n     2단계 침대에 묶은 스트레칭 밴드를 15회씩 3세트 당기는\n     운동을 진행함\n\n   - 운동하는 것이 재미없었는데 정기적으로 하다보니 힘든 것이\n     줄어서 15회 3세트를 수월하게 할 수 있게 되었다고 함"]
["개인관찰기록지","2022-03-21","○ 개별운동\n   0 장소 : 4호실\n   0 내용 : 스트레칭 밴드 운동, 소도구 활용 운동\n   \n   - 운동 내용\n     1단계 몸풀기로 양팔을 위, 아래로 들었다가 내리며 15회씩\n     3세트함\n\n     2단계 침대에 묶은 스트레칭 밴드를 15회씩 3세트 당기는\n     운동을 진행함\n\n   - 2세트 이후에 속도가 빨라져 천천히 운동할 수 있도록 \n     직원의 숫자에 맞춰 운동함\n\n   - 스펀지볼을 활용한 악력 운동 결과 왼손으로는 8회, 오른손 3회함"]
["개인관찰기록지","2022-03-22","○ 개별운동\n   0 장소 : 4호실\n   0 내용 : 스트레칭 밴드 운동\n   \n   - 운동 내용\n     1단계 몸풀기로 양팔을 위, 아래로 들었다가 내리며 15회씩\n     3세트함\n\n     2단계 침대에 묶은 스트레칭 밴드를 15회씩 3세트 당기는\n     운동을 진행함\n\n   - 컨디션이 좋지 않다고 해서 2세트만 하고 종료함"]
["개인관찰기록지","2022-03-28","○ 개별운동\n   0 장소 : 4호실\n   0 내용 : 스트레칭 밴드 운동, 소도구 활용 운동\n\n   - 운동 내용\n\n     1단계 몸풀기로 양팔을 위, 아래로 들었다가 내리며 15회씩 3세트함\n\n     2단계 침대에 묶은 스트레칭 밴드를 15회씩 3세트 당기는\n     운동을 진행함\n\n   - 2세트 넘어가면 속도가 빨라졌는데 천천히 해야 운동된다는 것을 \n     학습 후 스트레칭 밴드의 속도 조절하면서 천천히 운동함\n\n   - 스펀지볼을 활용한 악력 운동 결과 왼손으로는 8회, 오른손 3회함"]
["개인관찰기록지","2022-03-30","○ 개별운동\n   0 장소 : 4호실\n   0 내용 : 스트레칭 밴드 운동\n   \n   - 운동 내용\n     1단계 몸풀기로 양팔을 위, 아래로 들었다가 내리며 15회씩\n     3세트함\n\n     2단계 침대에 묶은 스트레칭 밴드를 15회씩 3세트 당기는\n     운동을 진행함\n\n   - 3세트 운동할때 당기고 멈춰서 운동 난의도를 올려 팔에\n     힘이 더 들어가는 것을 느꼈다고 함"]
["개인관찰기록지","2022-03-31","○ 개별운동\n   0 장소 : 4호실\n   0 내용 : 스트레칭 밴드 운동, 소도구 활용 운동\n   \n   - 운동 내용\n     1단계 몸풀기로 양팔을 위, 아래로 들었다가 내리며 15회씩\n     3세트함\n\n     2단계 침대에 묶은 스트레칭 밴드를 10회씩 3세트 당기는\n     운동을 진행함\n\n   - 컨디션이 좋지 않다고 해서 10회씩 3세트 하고 종료함\n\n   - 스펀지볼을 활용한 악력 운동 결과 왼손으로는 8회, 오른손 3회함"]
["개인관찰기록지","2022-04-04","○ 개별운동\n   0 장소 : 4호실\n   0 내용 : 스트레칭 밴드 운동\n   \n   - 운동 내용\n     1단계 몸풀기로 양팔을 위, 아래로 들었다가 내리며 15회씩\n     3세트함\n\n     2단계 침대에 묶은 스트레칭 밴드를 12회씩 3세트 당기는\n     운동을 진행함\n\n   - 컨디션이 좋지 않다고 해서 12회씩 3세트를 할 수 있도록 지원함"]
["개인관찰기록지","2022-04-07","○ 개별운동\n   0 장소 : 4호실\n   0 내용 : 스트레칭 밴드 운동, 소도구 활용 운동\n   \n   - 운동 내용\n     1단계 몸풀기로 양팔을 위, 아래로 들었다가 내리며 15회씩\n     3세트함\n\n     2단계 침대에 묶은 스트레칭 밴드를 15회씩 3세트 당기는\n     운동을 진행함\n\n   - 컨디션이 좋아져 15회 3세트를 모두 함\n\n   - 스펀지볼을 활용한 악력 운동 결과 왼손으로는 8회, 오른손 3회함"]
["개인관찰기록지","2022-04-11","○ 개별운동\n   0 장소 : 4호실\n   0 내용 : 스트레칭 밴드 운동\n   \n   - 운동 내용\n     1단계 몸풀기로 양팔을 위, 아래로 들었다가 내리며 15회씩\n     3세트함\n\n     2단계 침대에 묶은 스트레칭 밴드를 15회씩 3세트 당기는\n     운동을 진행함"]
["개인관찰기록지","2022-04-15","○ 개별운동\n   0 장소 : 4호실\n   0 내용 : 스트레칭 밴드 운동, 소도구 활용 운동\n   \n   - 운동 내용\n     1단계 몸풀기로 양팔을 위, 아래로 들었다가 내리며 15회씩\n     3세트함\n\n     2단계 침대에 묶은 스트레칭 밴드를 15회씩 3세트 당기는\n     운동을 진행함\n\n   - 스펀지볼을 활용한 악력 운동 결과 왼손으로는 8회, 오른손 3회함"]
["개인관찰기록지","2022-04-18","○ 개별운동\n   0 장소 : 4호실\n   0 내용 : 스트레칭 밴드 운동\n   \n   - 운동 내용\n     1단계 몸풀기로 양팔을 위, 아래로 들었다가 내리며 15회씩\n     3세트함\n\n     2단계 침대에 묶은 스트레칭 밴드를 15회씩 3세트 당기는\n     운동을 진행함"]
["개인관찰기록지","2022-04-21","○ 개별운동\n   0 장소 : 4호실\n   0 내용 : 스트레칭 밴드 운동, 소도구 활용 운동\n   \n   - 운동 내용\n     1단계 몸풀기로 양팔을 위, 아래로 들었다가 내리며 15회씩\n     3세트함\n\n     2단계 침대에 묶은 스트레칭 밴드를 15회씩 3세트 당기는\n     운동을 진행함\n\n   - 스펀지볼을 활용한 악력 운동 결과 왼손으로는 8회, 오른손 3회함"]
["개인관찰기록지","2022-04-25","○ 개별운동\n   0 장소 : 4호실\n   0 내용 : 스트레칭 밴드 운동\n   \n   - 운동 내용\n     1단계 몸풀기로 양팔을 위, 아래로 들었다가 내리며 15회씩\n     3세트함\n\n     2단계 침대에 묶은 스트레칭 밴드를 15회씩 3세트 당기는\n     운동을 진행함"]
["개인관찰기록지","2022-04-28","○ 개별운동\n   0 장소 : 4호실\n   0 내용 : 스트레칭 밴드 운동, 소도구 활용 운동\n   \n   - 운동 내용\n     1단계 몸풀기로 양팔을 위, 아래로 들었다가 내리며 15회씩\n     3세트함\n\n     2단계 침대에 묶은 스트레칭 밴드를 15회씩 3세트 당기는\n     운동을 진행함\n\n   - 스펀지볼을 활용한 악력 운동 결과 왼손으로는 8회, 오른손 3회함"]
["개인관찰기록지","2022-05-03","○ 개별운동\n   0 장소 : 4호실\n   0 내용 : 스트레칭 밴드 운동\n   \n   - 운동 내용\n     1단계 몸풀기로 양팔을 위, 아래로 들었다가 내리며 15회씩\n     3세트함\n\n     2단계 침대에 묶은 스트레칭 밴드를 15회씩 3세트 당기는\n     운동을 진행함"]
["개인관찰기록지","2022-05-06","○ 개별운동\n   0 장소 : 4호실\n   0 내용 : 스트레칭 밴드 운동, 소도구 활용 운동\n   \n   - 운동 내용\n     1단계 몸풀기로 양팔을 위, 아래로 들었다가 내리며 15회씩\n     3세트함\n\n     2단계 침대에 묶은 스트레칭 밴드를 15회씩 3세트 당기는\n     운동을 진행함\n\n   - 스펀지볼을 활용한 악력 운동 결과 왼손으로는 8회, 오른손 3회함"]
["개인관찰기록지","2022-05-09","○ 개별운동\n   0 장소 : 4호실\n   0 내용 : 스트레칭 밴드 운동\n   \n   - 운동 내용\n     1단계 몸풀기로 양팔을 위, 아래로 들었다가 내리며 15회씩\n     3세트함\n\n     2단계 침대에 묶은 스트레칭 밴드를 15회씩 3세트 당기는\n     운동을 진행함"]
["개인관찰기록지","2022-05-12","○ 개별운동\n   0 장소 : 4호실\n   0 내용 : 스트레칭 밴드 운동, 소도구 활용 운동\n   \n   - 운동 내용\n     1단계 몸풀기로 양팔을 위, 아래로 들었다가 내리며 15회씩\n     3세트함\n\n     2단계 침대에 묶은 스트레칭 밴드를 15회씩 3세트 당기는\n     운동을 진행함\n\n   - 스펀지볼을 활용한 악력 운동 결과 왼손으로는 8회, 오른손 3회함"]
["개인관찰기록지","2022-05-16","○ 개별운동\n   0 장소 : 4호실\n   0 내용 : 스트레칭 밴드 운동\n   \n   - 운동 내용\n     1단계 몸풀기로 양팔을 위, 아래로 들었다가 내리며 15회씩\n     3세트함\n\n     2단계 침대에 묶은 스트레칭 밴드를 15회씩 3세트 당기는\n     운동을 진행함"]
["개인관찰기록지","2022-05-20","○ 개별운동\n   0 장소 : 4호실\n   0 내용 : 스트레칭 밴드 운동, 소도구 활용 운동\n   \n   - 운동 내용\n     1단계 몸풀기로 양팔을 위, 아래로 들었다가 내리며 15회씩\n     3세트함\n\n     2단계 침대에 묶은 스트레칭 밴드를 15회씩 3세트 당기는\n     운동을 진행함\n\n   - 스펀지볼을 활용한 악력 운동 결과 왼손으로는 8회, 오른손 3회함"]
["개인관찰기록지","2022-05-23","○ 개별운동\n   0 장소 : 4호실\n   0 내용 : 스트레칭 밴드 운동\n   \n   - 운동 내용\n     1단계 몸풀기로 양팔을 위, 아래로 들었다가 내리며 15회씩\n     3세트함\n\n     2단계 침대에 묶은 스트레칭 밴드를 15회씩 3세트 당기는\n     운동을 진행함"]
["개인관찰기록지","2022-05-27","○ 개별운동\n   0 장소 : 4호실\n   0 내용 : 스트레칭 밴드 운동, 소도구 활용 운동\n   \n   - 운동 내용\n     1단계 몸풀기로 양팔을 위, 아래로 들었다가 내리며 15회씩\n     3세트함\n\n     2단계 침대에 묶은 스트레칭 밴드를 15회씩 3세트 당기는\n     운동을 진행함\n\n   - 스펀지볼을 활용한 악력 운동 결과 왼손으로는 8회, 오른손 3회함"]
["개인관찰기록지","2022-05-30","○ 개별운동\n   0 장소 : 4호실\n   0 내용 : 스트레칭 밴드 운동\n   \n   - 운동 내용\n     1단계 몸풀기로 양팔을 위, 아래로 들었다가 내리며 15회씩\n     3세트함\n\n     2단계 침대에 묶은 스트레칭 밴드를 15회씩 3세트 당기는\n     운동을 진행함"]
["개인관찰기록지","2022-06-17","○ 개별운동\n   0 장소 : 4호실\n   0 내용 : 스트레칭 밴드 운동\n   \n   - 운동 내용\n     1단계 몸풀기로 양팔을 위, 아래로 들었다가 내리며 15회씩\n     3세트함\n\n     2단계 침대에 묶은 스트레칭 밴드를 15회씩 3세트 당기는\n     운동을 진행함"]
["생활일지","2022-01-01","- 전동휠체어 승, 하차 지원함/  ,     \n\n- 점심, 저녁 식사 후 양치 지원함/    "]
["생활일지","2022-01-02","- 전동휠체어 승, 하차 지원함/    \n\n- 점심, 저녁 식사 후 양치 지원함/  ,     "]
["생활일지","2022-01-03","- 전동휠체어 승, 하차 지원함/    \n\n- 점심, 저녁 식사 후 양치 지원함/    \n\n- 18:30 목욕 지원함/  "]
["생활일지","2022-01-04","- 전동휠체어 승, 하차 지원함/  \n\n- 점심, 저녁 식사 후 양치 지원함/    ,     "]
["생활일지","2022-01-05","- 전동휠체어 승, 하차 지원함/  \n\n- 점심, 저녁 식사 후 양치 지원함/  ,     "]
["생활일지","2022-01-06","- 전동휠체어 승, 하차 지원함/    \n\n- 점심, 저녁 식사 후 양치 지원함/    "]
["생활일지","2022-01-07","- 전동휠체어 승, 하차 지원함/  ,     \n\n- 점심, 저녁 식사 후 양치 지원함/    ,     "]
["생활일지","2022-01-08","- 전동휠체어 승, 하차 지원함/    \n\n- 점심, 저녁 식사 후 양치 지원함/  ,     "]
["생활일지","2022-01-09","- 전동휠체어 승, 하차 지원함/    \n\n- 점심, 저녁 식사 후 양치 지원함/    \n\n- 16:30 목욕 지원함/  "]
["생활일지","2022-01-10","- 전동휠체어 승, 하차 지원함/  \n\n- 점심, 저녁 식사 후 양치 지원함/    ,     "]
["생활일지","2022-01-11","- 전동휠체어 승, 하차 지원함/    \n\n- 점심, 저녁 식사 후 양치 지원함/    ,     "]
["생활일지","2022-01-12","- 전동휠체어 승, 하차 지원함/    \n\n- 점심, 저녁 식사 후 양치 지원함/    ,   "]
["생활일지","2022-01-13","- 전동휠체어 승, 하차 지원함/  ,     \n\n- 점심, 저녁 식사 후 양치 지원함/    ,     "]
["생활일지","2022-01-14","- 전동휠체어 승, 하차 지원함/    ,   ,     \n\n- 점심, 저녁 식사 후 양치 지원함/  ,     "]
["생활일지","2022-01-15","- 전동휠체어 승, 하차 지원함/    ,     \n\n- 점심, 저녁 식사 후 양치 지원함/    \n\n- 16:30 목욕 지원함/  "]
["생활일지","2022-01-16","- 전동휠체어 승, 하차 지원함/  ,     \n\n- 점심, 저녁 식사 후 양치 지원함/    ,     "]
["생활일지","2022-01-17","- 전동휠체어 승, 하차 지원함/    ,   ,     \n\n- 점심, 저녁 식사 후 양치 지원함/  ,     "]
["생활일지","2022-01-18","- 전동휠체어 승, 하차 지원함/    \n\n- 점심, 저녁 식사 후 양치 지원함/    ,   "]
["생활일지","2022-01-19","- 전동휠체어 승, 하차 지원함/  ,     \n\n- 점심, 저녁 식사 후 양치 지원함/    ,     "]
["생활일지","2022-01-20","- 전동휠체어 승, 하차 지원함/    \n\n- 점심, 저녁 식사 후 양치 지원함/  ,     "]
["생활일지","2022-01-21","- 전동휠체어 승, 하차 지원함/    ,     ,   \n\n- 점심, 저녁 식사 후 양치 지원함/    ,   \n\n- 16:40 침대에서 대변 실수하여 목욕 지원함/  "]
["생활일지","2022-01-22","- 전동휠체어 승, 하차 지원함/  \n\n- 점심, 저녁 식사 후 양치 지원함/    ,     "]
["생활일지","2022-01-23","- 전동휠체어 승, 하차 지원함/    \n\n- 점심, 저녁 식사 후 양치 지원함/  ,     "]
["생활일지","2022-01-24","- 전동휠체어 승, 하차 지원함/    ,     \n\n- 10:30 전동휠체어 타이어펑크로 수리업체에 수리요청함/    \n\n- 12:20 전동휠체어 수리 완료 후 수령함/    \n\n- 점심 식사 후 양치 지원함/    "]
["생활일지","2022-01-25","- 전동휠체어 승, 하차 지원함/  ,     ,     \n\n- 점심, 저녁 식사 후 양치 지원함/    ,     "]
["생활일지","2022-01-26","- 전동휠체어 승, 하차 지원함/    \n\n- 점심, 저녁 식사 후 양치 지원함/  ,     \n\n- 동료이용인(한병인)에게 떡을 받았는데 먹어도 되는지 물어보심. 한병인씨\n  에게는 말하지 말라고 부탁함/  "]
["생활일지","2022-01-27","- 전동휠체어 승, 하차 지원함/    ,     \n\n- 점심, 저녁 식사 후 양치 지원함/    \n\n- 16:30 목욕 및 다리 각질 관리를 위해 보습제 발라 드림/  "]
["생활일지","2022-01-28","- 전동휠체어 승, 하차 지원함/  ,     \n\n- 점심, 저녁 식사 후 양치 지원함/    "]
["생활일지","2022-01-29","- 전동휠체어 승, 하차 지원함/    \n\n- 점심, 저녁 식사 후 양치 지원함/  ,     "]
["생활일지","2022-01-30","- 전동휠체어 승, 하차 지원함/    \n\n- 점심, 저녁 식사 후 양치 지원함/    ,   "]
["생활일지","2022-01-31","- 전동휠체어 승, 하차 지원함/  ,     \n\n- 점심, 저녁 식사 후 양치 지원함/    ,     "]
["생활일지","2022-02-01","- 전동휠체어 승, 하차 지원함/    ,   ,     \n\n- 09:30 ~ 11:30 차례상 차리기 및 차례 지내기 참여함\n\n- 점심, 저녁 식사 후 양치 지원함/  ,     "]
["생활일지","2022-02-02","- 전동휠체어 승, 하차 지원함/    ,     ,   \n\n- 15:00 ~ 17:00 보치아 참여함\n\n- 점심, 저녁 식사 후 양치 지원함/    ,   \n\n- 16:30 목욕 및 다리 각질 관리를 위해 보습제 발라 드림/  "]
["생활일지","2022-02-03","- 전동휠체어 승, 하차 지원함/  ,     ,     \n\n- 점심, 저녁 식사 후 양치 지원함/    ,     "]
["생활일지","2022-02-04","- 전동휠체어 승, 하차 지원함/    ,     \n\n- 저녁 식사 후 양치 지원함/    "]
["생활일지","2022-02-05","- 전동휠체어 승, 하차 지원함/    ,     \n\n- 점심, 저녁 식사 후 양치 지원함/    "]
["생활일지","2022-02-06","- 전동휠체어 승, 하차 지원함/  ,     ,     \n\n- 점심, 저녁 식사 후 양치 지원함/    ,     "]
["생활일지","2022-02-07","- 전동휠체어 승, 하차 지원함/    ,   ,     \n\n- 점심, 저녁 식사 후 양치 지원함/  ,     "]
["생활일지","2022-02-08","- 전동휠체어 승, 하차 지원함/    ,     \n\n- 점심, 저녁 식사 후 양치 지원함/    ,   "]
["생활일지","2022-02-09","- 전동휠체어 승, 하차 지원함/  ,     ,     \n\n- 점심, 저녁 식사 후 양치 지원함/    ,     "]
["생활일지","2022-02-10","- 전동휠체어 승, 하차 지원함/    \n\n- 11:00 목욕 지원함/  \n\n- 점심, 저녁 식사 후 양치 지원함/  ,     "]
["생활일지","2022-02-11","- 전동휠체어 승, 하차 지원함/    ,     ,   \n\n- 점심, 저녁 식사 후 양치 지원함/    ,   "]
["생활일지","2022-02-12","- 전동휠체어 승, 하차 지원함/  ,     ,     \n\n- 점심, 저녁 식사 후 양치 지원함/    ,     "]
["생활일지","2022-02-13","- 전동휠체어 승, 하차 지원함/    ,   ,     \n\n- 점심, 저녁 식사 후 양치 지원함/  ,     "]
["생활일지","2022-02-14","- 전동휠체어 승, 하차 지원함/    \n\n- 아침 식사 도중 화장실이 급하다 하여 화장실(대변보심) 지원함/     \n\n- 컷트함 \n\n- 점심, 저녁 식사 후 양치 지원함/    ,   \n\n- 16:30 목욕 지원함/  "]
["생활일지","2022-02-15","- 전동휠체어 승, 하차 지원함/  ,     ,     \n\n- 아침 식사 도중 화장실이 급하다 하여 화장실(대변보심) 지원함/  \n\n- 점심, 저녁 식사 후 양치 지원함/    ,     \n\n- 19:00 면도 요청하셔서 면도지원해드림/    \n\n- 규칙적인 배변습관을 기르기 위해 기존에 07시였던 아침 기상시간을 06:30분\n  으로 변경하는게 어떻겠냐고 건의드리니 흔쾌히 알겠다고 하심/    "]
["생활일지","2022-02-16","- 전동휠체어 승, 하차 지원함/    \n\n- 점심, 저녁 식사 후 양치 지원함/  ,     "]
["생활일지","2022-02-17","- 전동휠체어 승, 하차 지원함/    ,     ,   \n\n- 점심, 저녁 식사 후 양치 지원함/    ,   "]
["생활일지","2022-02-18","- 전동휠체어 승, 하차 지원함/  ,     ,     \n\n- 점심, 저녁 식사 후 양치 지원함/    ,     "]
["생활일지","2022-02-19","- 전동휠체어 승, 하차 지원함/    ,     \n\n- 저녁 식사 후 양치 지원함/    "]
["생활일지","2022-02-20","- 전동휠체어 승, 하차 지원함/    ,     ,   \n\n- 점심, 저녁 식사 후 양치 지원함/    ,   "]
["생활일지","2022-02-21","- 전동휠체어 승, 하차 지원함/  \n\n- 점심, 저녁 식사 후 양치 지원함/    "]
["생활일지","2022-02-22","- 전동휠체어 승, 하차 지원함/  ,   ,     \n\n- 저녁 식사 후 양치 지원함/    "]
["생활일지","2022-02-23","- 전동휠체어 승, 하차 지원함/    \n\n- 저녁 식사 후 양치 지원함/  \n\n- 19:30 목욕 지원 중 가슴 중앙에 피부가 붉어 간호사에게 인계한다고 \n  안내함/  "]
["생활일지","2022-02-24","- 전동휠체어 승, 하차 지원함/  \n\n- 저녁 식사 후 양치 지원함/    "]
["생활일지","2022-02-25","- 전동휠체어 승, 하차 지원함/    \n\n- 저녁 식사 후 양치 지원함/  \n\n- 19:30 목욕 지원함/  "]
["생활일지","2022-02-26","- 전동휠체어 승, 하차 지원함/  \n- 점심, 저녁 식사 후 양치 지원함/    ,   "]
["생활일지","2022-02-27","- 전동휠체어 승, 하차 지원함/  ,     ,     \n- 점심, 저녁 식사 후 양치 지원함/    ,     "]
["생활일지","2022-02-28","- 전동휠체어 승, 하차 지원함/    ,   ,     \n- 점심, 저녁 식사 후 양치 지원함/    "]
["생활일지","2022-03-01","- 전동휠체어 승, 하차 지원함/    ,     ,   \n- 점심, 저녁 식사 후 양치 지원함/    .   "]
["생활일지","2022-03-02","- 전동휠체어 승, 하차 지원함/  ,     ,     \n- 점심, 저녁 식사 후 양치 지원함/    ,     "]
["생활일지","2022-03-03","- 전동휠체어 승, 하차 지원함/    \n- 점심, 저녁 식사 후 양치 지원함/  ,     "]
["생활일지","2022-03-04","- 전동휠체어 승, 하차 지원함/    ,     ,   \n- 점심, 저녁 식사 후 양치 지원함/    ,   \n- 19:30 목욕 지원 후 각질 관리를 위해 보습로션 도포해 드림/  "]
["생활일지","2022-03-05","- 전동휠체어 승, 하차 지원함/  ,     ,     \n- 점심, 저녁 식사 후 양치 지원함/    ,     "]
["생활일지","2022-03-06","- 전동휠체어 승, 하차 지원함/    \n- 점심, 저녁 식사 후 양치 지원함/  ,     "]
["생활일지","2022-03-07","- 전동휠체어 승, 하차 지원함/    ,     ,   \n- 점심, 저녁 식사 후 양치 지원함/    .   ]\n- 19:00 목욕 지원 후 보습제 및 피부연고 도포함/  "]
["생활일지","2022-03-08","- 전동휠체어 승, 하차 지원함/  ,     ,     \n- 점심, 저녁 식사 후 양치 지원함/    ,     "]
["생활일지","2022-03-09","- 전동휠체어 승, 하차 지원함/    \n- 점심, 저녁 식사 후 양치 지원함/  ,     "]
["생활일지","2022-03-10","- 전동휠체어 승, 하차 지원함/    ,     ,   \n- 점심, 저녁 식사 후 양치 지원함/    ,   \n- 19:30 목욕 지원 및 보습제 도포 지원함/  "]
["생활일지","2022-03-11","- 전동휠체어 승, 하차 지원함/  ,    \n- 저녁 식사 후 양치 지원함/    "]
["생활일지","2022-03-12","- 전동휠체어 승, 하차 지원함/    \n- 점심, 저녁 식사 후 양치 지원함/  \n- 14:30 손톱 정리 지원함/  "]
["생활일지","2022-03-13","- 전동휠체어 승, 하차 지원함/    \n- 점심, 저녁 식사 후 양치 지원함/    "]
["생활일지","2022-03-14","- 전동휠체어 승, 하차 지원함/  \n- 점심, 저녁 식사 후 양치 지원함/  "]
["생활일지","2022-03-15","- 전동휠체어 승, 하차 지원함/  ,   ,     \n- 저녁 식사 후 양치 지원함/    "]
["생활일지","2022-03-16","- 전동휠체어 승, 하차 지원함/    \n- 저녁 식사 후 양치 지원함/  "]
["생활일지","2022-03-17","- 전동휠체어 승, 하차 지원함/  ,     \n- 저녁 식사 후 양치 지원함/    "]
["생활일지","2022-03-18","- 전동휠체어 승, 하차 지원함/    \n- 점심, 저녁 식사 후 양치 지원함/  "]
["생활일지","2022-03-19","- 전동휠체어 승, 하차 지원함/  ,     \n- 점심, 저녁 식사 후 양치 지원함/    ,   "]
["생활일지","2022-03-20","- 전동휠체어 승, 하차 지원함/  ,     ,     \n- 점심, 저녁 식사 후 양치 지원함/    ,     "]
["생활일지","2022-03-21","- 전동휠체어 승, 하차 지원함/    ,     \n- 저녁 식사 후 양치 지원함/    "]
["생활일지","2022-03-22","- 전동휠체어 승, 하차 지원함/    ,     ,   \n- 점심, 저녁 식사 후 양치 지원함/    ,   "]
["생활일지","2022-03-23","- 전동휠체어 승, 하차 지원함/  ,     ,     \n- 점심, 저녁 식사 후 양치 지원함/    ,     "]
["생활일지","2022-03-24","- 전동휠체어 승, 하차 지원함/    ,     \n- 점심, 저녁 식사 후 양치 지원함/  ,     "]
["생활일지","2022-03-25","- 전동휠체어 승, 하차 지원함/    ,     \n- 점심, 저녁 식사 후 양치 지원함/    ,   \n- 19:30 목욕 지원 후 보습제 및 피부연고 도포함/  "]
["생활일지","2022-03-26","- 전동휠체어 승, 하차 지원함/  ,     ,     \n- 점심, 저녁 식사 후 양치 지원함/    ,     "]
["생활일지","2022-03-27","- 전동휠체어 승, 하차 지원함/    \n- 점심, 저녁 식사 후 양치 지원함/  ,     "]
["생활일지","2022-03-28","- 전동휠체어 승, 하차 지원함/    ,   \n- 점심, 저녁 식사 후 양치 지원함/    ,   "]
["생활일지","2022-03-29","- 전동휠체어 승, 하차 지원함/  ,     \n- 저녁 식사 후 양치 지원함/    \n- 기존 태블릿PC 수리예정으로 보관중이던 서브태블릿PC로 교체해드림/    "]
["생활일지","2022-03-30","- 전동휠체어 승, 하차 지원함/    ,     \n- 점심, 저녁 식사 후 양치 지원함/  ,     "]
["생활일지","2022-03-31","- 전동휠체어 승, 하차 지원함/    ,     ,   \n- 점심, 저녁 식사 후 양치 지원함/    ,   \n- 17:00 목욕 지원함/  "]
["생활일지","2022-04-01","- 전동휠체어 승, 하차 지원함/  ,     ,     \n- 점심, 저녁 식사 후 양치 지원함/    ,     "]
["생활일지","2022-04-02","- 전동휠체어 승, 하차 지원함/    ,   ,     \n- 점심, 저녁 식사 후 양치 지원함/  ,     "]
["생활일지","2022-04-03","- 전동휠체어 승, 하차 지원함/    \n- 점심, 저녁 식사 후 양치 지원함/    ,   "]
["생활일지","2022-04-04","- 전동휠체어 승, 하차 지원함/    \n- 점심, 저녁 식사 후 양치 지원함/    ,     "]
["생활일지","2022-04-05","- 전동휠체어 승, 하차 지원함/  \n- 점심, 저녁 식사 후 양치 지원함/  ,     "]
["생활일지","2022-04-06","- 전동휠체어 승, 하차 지원함/    ,     \n- 점심, 저녁 식사 후 양치 지원함/    "]
["생활일지","2022-04-07","- 전동휠체어 승, 하차 지원함/    , 나승현\n- 저녁 식사 후 양치 지원함/    "]
["생활일지","2022-04-08","- 전동휠체어 승, 하차 지원함/    ,     \n- 점심, 저녁 식사 후 양치 지원함/  ,     "]
["생활일지","2022-04-09","- 전동휠체어 승, 하차 지원함/    \n- 점심, 저녁 식사 후 양치 지원함/    ,   "]
["생활일지","2022-04-10","- 전동휠체어 승, 하차 지원함/  ,     \n- 점심, 저녁 식사 후 양치 지원함/    ,     "]
["생활일지","2022-04-11","- 전동휠체어 승, 하차 지원함/  ,     \n- 점심, 저녁 식사 후 양치 지원함/  ,     "]
["생활일지","2022-04-12","- 전동휠체어 승, 하차 지원함/    ,   \n- 점심, 저녁 식사 후 양치 지원함/    ,   \n- 19:00 목욕 지원함/  "]
["생활일지","2022-04-13","- 전동휠체어 승, 하차 지원함/  \n- 저녁 식사 후 양치 지원함/    "]
["생활일지","2022-04-14","- 전동휠체어 승, 하차 지원함/    ,   ,     \n- 점심, 저녁 식사 후 양치 지원함/  ,     "]
["생활일지","2022-04-15","- 전동휠체어 승, 하차 지원함/    ,     ,   \n- 점심, 저녁 식사 후 양치 지원함/    ,   \n- 16:30 목욕 및 보습제 도포 지원함/  "]
["생활일지","2022-04-16","- 전동휠체어 승, 하차 지원함/  ,     ,     \n- 점심, 저녁 식사 후 양치 지원함/    ,     "]
["생활일지","2022-04-17","- 전동휠체어 승, 하차 지원함/  ,     \n- 점심, 저녁 식사 후 양치 지원함/  ,     "]
["생활일지","2022-04-18","- 전동휠체어 승, 하차 지원함/    ,     \n- 점심, 저녁 식사 후 양치 지원함/    ,   "]
["생활일지","2022-04-19","- 전동휠체어 승, 하차 지원함/    \n- 점심, 저녁 식사 후 양치 지원함/    "]
["생활일지","2022-04-20","- 전동휠체어 승, 하차 지원함/    ,   ,     \n- 16:50 바지에 대변 실수하여 목욕 권유했으나 물티슈로 닦아달라고 하셔서\n  물티슈로 닦아 드린 후 바지 갈아 입혀드리고 세탁 지원함/    \n- 저녁 식사 후 양치 지원함/    "]
["생활일지","2022-04-21","- 전동휠체어 승, 하차 지원함/    ,     \n- 점심, 저녁 식사 후 양치 지원함/    ,   "]
["생활일지","2022-04-22","- 전동휠체어 승, 하차 지원함/  ,     \n- 점심, 저녁 식사 후 양치 지원함/    "]
["생활일지","2022-04-23","- 전동휠체어 승, 하차 지원함/  ,     \n- 점심, 저녁 식사 후 양치 지원함/  ,     "]
["생활일지","2022-04-24","- 전동휠체어 승, 하차 지원함/    ,   \n- 점심, 저녁 식사 후 양치 지원함/    ,   \n- 19:00 목욕 및 보습제 도포 지원함 머리와 얼굴에 붉은색 피부 발진이 보여\n  간호사에게 증상 전달한다고 안내함/   \n- 20:00 이준희, 김영호, 박명수님과 함께 순살치킨 시켜드심/  "]
["생활일지","2022-04-25","- 전동휠체어 승, 하차 지원함/    , \n- 점심, 저녁 식사 후 양치 지원함/    ,     "]
["생활일지","2022-04-26","- 전동휠체어 승, 하차 지원함/    ,     \n- 저녁 식사 후 양치 지원함/    "]
["생활일지","2022-04-27","- 전동휠체어 승, 하차 지원함/    \n- 점심, 저녁 식사 후 양치 지원함/    "]
["생활일지","2022-04-28","- 전동휠체어 승, 하차 지원함/  ,     \n- 저녁 식사 후 양치 지원함/    \n- 20:30 두피에 프레벨연고, 얼굴 에스트라크림 발라드림/    "]
["생활일지","2022-04-29","- 전동휠체어 승, 하차 지원함/  ,     \n- 11:30 ~ 14:00 동암고 산책 다녀옴\n- 저녁 식사 후 양치 지원함/    \n- 19:40 화장실 지원함/    "]
["생활일지","2022-04-30","- 08:00 화장실 지원함/    \n- 전동휠체어 승, 하차 지원함/    ,     \n- 점심, 저녁 식사 후 양치 지원함/    ,   \n- 16:30 목욕 및 보습제 도포 지원함/  \n- 17:30 손톱 정리 지원함/  "]
["생활일지","2022-05-01","- 08:00 화장실 지원함/  \n- 전동휠체어 승, 하차 지원함/  ,     ,     \n- 점심, 저녁 식사 후 양치 지원함/    ,     "]
["생활일지","2022-05-02","- 08:00 화장실 지원함/    \n- 전동휠체어 승, 하차 지원함/    ,   ,     \n- 점심, 저녁 식사 후 양치 지원함/  ,     "]
["생활일지","2022-05-03","- 07:50 화장실 지원함/    \n- 전동휠체어 승, 하차 지원함/  \n- 옷장 정리해 드림/  , 정혜옥\n- 저녁 식사 후 양치 지원함/  "]
["생활일지","2022-05-04","- 07:50, 12:30 화장실 지원함/  ,     \n- 전동휠체어 승, 하차 지원함/    ,     \n- 옷장 정리 정돈 및 침대 밑 주변 등 정리 지원함/  ,   \n- 점심, 저녁 식사 후 양치 지원함/    ,     "]
["생활일지","2022-05-05","- 07:50 화장실 지원함/    \n- 전동휠체어 승, 하차 지원함/    ,     \n- 점심, 저녁 식사 후 양치 지원함/  ,     \n- 05:45 침대에서 대변 실수 하셔서 위생 및 청소 지원함/    \n- 06:15 화장실 지원함/    "]
["생활일지","2022-05-06","- 전동휠체어 승, 하차 지원함/    ,     ,   \n- 08:00 화장실 지원함/    \n- 점심, 저녁 식사 후 양치 지원함/    ,   \n- 16:50 목욕 및 보습제 도포 지원함/  \n- 20:00 백상진, 김영호, 이준희, 송성복님과 함께 치킨 시켜드심/  "]
["생활일지","2022-05-07","- 전동휠체어 승, 하차 지원함/    ,     \n- 07:30, 09:10 화장실 지원함/  ,     \n- 점심, 저녁 식사 후 양치 지원함/    ,     "]
["생활일지","2022-05-08","- 전동휠체어 승, 하차 지원함/    ,   ,     \n- 07:30, 09:10 화장실 지원함/    \n- 점심, 저녁 식사 후 양치 지원함/  ,     "]
["생활일지","2022-05-09","- 전동휠체어 승, 하차 지원함/    ,   \n- 07:30, 09:10 화장실 지원함/    \n- 점심, 저녁 식사 후 양치 지원함/    ,   \n- 19:00 목욕 지원 및 보습제 도포해 드림/  "]
["생활일지","2022-05-10","- 전동휠체어 승, 하차 지원함/    ,\n- 점심, 저녁 식사 후 양치 지원함/    ,     "]
["생활일지","2022-05-11","- 전동휠체어 승, 하차 지원함/    ,   ,     \n- 11:00 코로나 4차 접종함\n- 점심, 저녁 식사 후 양치 지원함/  ,     "]
["생활일지","2022-05-12","- 전동휠체어 승, 하차 지원함/    ,     \n- 점심, 저녁 식사 후 양치 지원함/    ,   "]
["생활일지","2022-05-13","- 전동휠체어 승, 하차 지원함/  , 이광륜\n- 저녁 식사 후 양치 지원함/    "]
["생활일지","2022-05-14","- 전동휠체어 승, 하차 지원함/    ,   ,   \n- 07:50, 08:30 화장실 지원함/  ,     \n- 점심, 저녁 식사 후 양치 지원함/  ,   \n- 13:30 목욕 및 보습제 도포 지원함/  \n- 14:00 발톱 정리함/  "]
["생활일지","2022-05-15","- 전동휠체어 승, 하차 지원함/    ,     \n- 점심, 저녁 식사 후 양치 지원함/    ,     "]
["생활일지","2022-05-16","- 전동휠체어 승, 하차 지원함/    ,   ,     \n- 점심, 저녁 식사 후 양치 지원함/  ,   \n- 전동휠체어 내구연한이 5월 10일 종료된다며 새로운 전동휠체어 신청하고\n  싶다고 하여 간호사에게 전달하겠다고 안내함/  "]
["생활일지","2022-05-17","- 전동휠체어 승, 하차 지원함/    \n- 점심, 저녁 식사 후 양치 지원함/  ,     "]
["생활일지","2022-05-18","- 전동휠체어 승, 하차 지원함/  ,   ,     \n- 점심, 저녁 식사 후 양치 지원함/  ,   ,     \n- 13:30 사회적응훈련 지원함/  ,   "]
["생활일지","2022-05-19","- 전동휠체어 승, 하차 지원함/    ,   ,     \n- 점심, 저녁 식사 후 양치 지원함/  ,     "]
["생활일지","2022-05-20","- 07:30 화장실 지원함/    \n- 전동휠체어 승, 하차 지원함/    ,   ,     ,   \n- 점심, 저녁 식사 후 양치 지원함/  \n- 18:30 목욕 지원함/  ,   "]
["생활일지","2022-05-21","- 07:30, 13:00 화장실 지원함/  ,     \n- 전동휠체어 승, 하차 지원함/  ,     \n- 점심, 저녁 식사 후 양치 지원함/    ,   \n- 19:00 배달음식(치킨) 드심"]
["생활일지","2022-05-22","- 07:30, 13:00 화장실 지원함/  \n- 전동휠체어 승, 하차 지원함/  \n- 점심, 저녁 식사 후 양치 지원함/  ,     "]
["생활일지","2022-05-23","- 전동휠체어 승, 하차 지원함/    ,   ,     \n- 점심, 저녁 식사 후 양치 지원함/  ,     "]
["생활일지","2022-05-24","- 08:00 화장실 지원함/    \n- 전동휠체어 승, 하차 지원함/    ,     \n- 점심, 저녁 식사 후 양치 지원함/    \n- 19:00 목욕 및 보습제 도포 지원함/  \n- 20:00 손톱 정리 지원함/  "]
["생활일지","2022-05-25","- 전동휠체어 승, 하차 지원함/  ,     \n- 점심, 저녁 식사 후 양치 지원함/    ,    "]
["생활일지","2022-05-26","- 전동휠체어 승, 하차 지원함/  ,   ,     \n- 07:00 생활실 침대에서 대변 실수하여 위생 지원함/  \n- 이용인 야유회 참여\n- 저녁 식사 후 양치 지원함/    "]
["생활일지","2022-05-27","- 07:00 아침 식사 전 화장실 2번 지원함/    \n- 전동휠체어 승, 하차 지원함/    ,     \n- 점심, 저녁 식사 후 양치 지원함/  ,     "]
["생활일지","2022-05-28","- 07:50 화장실 지원함/    \n- 전동휠체어 승, 하차 지원함/    ,     ,   \n- 점심, 저녁 식사 후 양치 지원함/    ,   "]
["생활일지","2022-05-29","- 전동휠체어 승, 하차 지원함/  ,     \n- 점심, 저녁 식사 후 양치 지원함/    ,   "]
["생활일지","2022-05-30","- 전동휠체어 승, 하차 지원함/  ,     ,     \n- 점심, 저녁 식사 후 양치 지원함/  ,     "]
["생활일지","2022-05-31","- 전동휠체어 승, 하차 지원함/    ,   ,     \n- 점심, 저녁 식사 후 양치 지원함/  ,     \n- 19:10 머리 피부 연고 도포함/정인순"]
["생활일지","2022-06-01","- 전동휠체어 승, 하차 지원함/    ,     \n- 07:30 화장실 지원함/    \n- 점심, 저녁 식사 후 양치 지원함/    ,   \n- 19:30 목욕 및 보습제 도포 지원함/  "]
["생활일지","2022-06-02","- 전동휠체어 승, 하차 지원함/    ,     ,  \n- 08:00 화장실 지원함/    \n- 점심, 저녁 식사 후 양치 지원함/    ,   "]
["생활일지","2022-06-03","- 전동휠체어 승, 하차 지원함/  ,   \n- 점심, 저녁 식사 후 양치 지원함/    "]
["생활일지","2022-06-04","- 전동휠체어 승, 하차 지원함/    ,   ,     \n- 08:30 화장실 지원함/  \n- 점심, 저녁 식사 후 양치 지원함/  ,     "]
["생활일지","2022-06-05","- 전동휠체어 승, 하차 지원함/    ,     \n- 점심, 저녁 식사 후 양치 지원함/    ,   "]
["생활일지","2022-06-06","- 07:10, 08:15 화장실 지원함/  ,     \n- 전동휠체어 승, 하차 지원함/  ,     ,   \n- 점심, 저녁 식사 후 양치 지원함/    ,   "]
["생활일지","2022-06-07","- 전동휠체어 승, 하차 지원함/  ,     ,     \n- 08:10 화장실 지원함/  \n- 점심, 저녁 식사 후 양치 지원함/    ,     "]
["생활일지","2022-06-08","- 전동휠체어 승, 하차 지원함/    ,   ,     \n- 07:50, 09:10, 12:30 화장실 이동 지원함/    ,   \n- 점심, 저녁 식사 후 양치 지원함/  ,     "]
["생활일지","2022-06-09","- 전동휠체어 승, 하차 지원함/    ,   \n- 08:10 화장실 이동 지원함/    \n- 점심, 저녁 식사 후 양치 지원함/  ,   \n- 12:30 은행업무로 외출하신다 하여 안전사항 설명드린 후 외출나가심/    \n- 12:30 ~ 13:10 외출하여 우체국 가시던 중 전동휠체어에서 넘어져 왼쪽 팔과\n  무릎에 상처가 생겼지만 직원에게 말하지 않고 있다가 19:30 목욕\n  지원 중 직원이 발견하여 물어보니 외출 중 이동하다가 전동휠체어에서\n  바닥에 넘어져 긁혔다고해서 목욕 후 연고 도포해 드리고 내일 간호사\n  선생에게 인계해 드리겠다고 안내함/  "]
["생활일지","2022-06-10","- 전동휠체어 승, 하차 지원함/  ,     ,     \n- 08:20 화장실 이동 지원함/    \n- 점심, 저녁 식사 후 양치 지원함/    ,   "]
["생활일지","2022-06-11","- 전동휠체어 승, 하차 지원함/  ,   ,     \n- 점심, 저녁 식사 후 양치 지원함/  ,     \n- 20:30 어깨,무릎상처 에스로반 연고 발라드림/    "]
["생활일지","2022-06-12","- 전동휠체어 승, 하차 지원함/    ,   ,     \n- 09:00 화장실 지원함/  \n- 점심, 저녁 식사 후 양치 지원함/  ,     \n- 20:00 왼쪽어깨와 무릎 상처에 연고 도포 해 드림/    "]
["생활일지","2022-06-13","- 전동휠체어 승, 하차 지원함/    ,   \n- 07:10, 12:20 화장실 지원함/    ,   \n- 점심, 저녁 식사 후 양치 지원함/  ,   "]
["생활일지","2022-06-14","- 전동휠체어 승, 하차 지원함/  ,     \n- 07:10 화장실 지원함/  \n- 점심, 저녁 식사 후 양치 지원함/    ,   "]
["생활일지","2022-06-15","- 전동휠체어 승, 하차 지원함/  ,   ,     \n- 점심, 저녁 식사 후 양치 지원함/  ,     \n- 21:10 어깨, 무릎 상처에 연고 발라드림/    "]
["생활일지","2022-06-16","- 전동휠체어 승, 하차 지원함/  ,   ,     \n- 점심, 저녁 식사 후 양치 지원함/  ,     \n- 21:10 어깨, 무릎 상처에 연고 발라드림/    "]
["생활일지","2022-06-17","- 전동휠체어 승, 하차 지원함/    ,   ,   \n- 점심, 저녁 식사 후 양치 지원함/  ,   \n- 19:30 손톱정리 지원함/  \n- 21:10 어깨, 무릎 상처에 연고 발라드림/  "]
["생활일지","2022-06-18","- 전동휠체어 승, 하차 지원함/  ,   \n- 점심, 저녁 식사 후 양치 지원함/    ,   \n- 12:00, 20:00 화장실 이동 지원함/    ,   \n- 21:10 어깨, 무릎 상처에 연고 발라드림/  \n- 06:50 면도 지원함/  "]
["생활일지","2022-06-19","- 전동휠체어 승, 하차 지원함/  ,     \n- 점심, 저녁 식사 후 양치 지원함/  ,     \n- 13:30 목욕 지원함/  \n- 20:00 화장실 이동 지원함/    \n- 21:10 어깨, 무릎 상처 좋아져 연고 도포 종료함/    "]
["생활일지","2022-06-20","- 전동휠체어 승, 하차 지원함/    ,   ,     \n- 점심, 저녁 식사 후 양치 지원함/  ,     \n- 08:40, 10:40 화장실 지원함/  "]
["생활일지","2022-06-21","- 전동휠체어 승, 하차 지원함/    ,     ,   ,   \n- 점심, 저녁 식사 후 양치 지원함/  ,   "]
["생활일지","2022-06-22","- 전동휠체어 승, 하차 지원함/  ,     ,     ,    \n- 08:10, 09:30 화장실 지원함/    ,     \n- 점심, 저녁 식사 후 양치 지원함/    ,   "]
["생활일지","2022-06-23","- 전동휠체어 승, 하차 지원함/  ,     ,   ,     \n- 08:00, 12:00 화장실 지원함/  ,     \n- 점심, 저녁 식사 후 양치 지원함/    ,     "]
["생활일지","2022-06-24","- 전동휠체어 승, 하차 지원함/    ,   ,     \n- 07:40 화장실 지원함/    \n- 점심, 저녁 식사 후 양치 지원함/  ,     "]
["생활일지","2022-06-25","- 전동휠체어 승, 하차 지원함/    ,     ,   \n- 07:40 화장실 지원함/    \n- 점심, 저녁 식사 후 양치 지원함/    ,   \n- 19:30 김영호님, 이준희님, 문지경님과 상담실에서 치킨 시켜드심/  "]
["생활일지","2022-06-26","- 전동휠체어 승, 하차 지원함/  ,     ,   \n- 07:00 목욕 지원함/  \n- 08:40 화장실 지원함/    \n- 점심, 저녁 식사 후 양치 지원함/    ,   "]
["생활일지","2022-06-27","- 전동휠체어 승, 하차 지원함/  ,   ,     \n- 점심, 저녁 식사 후 양치 지원함/  ,     "]
["생활일지","2022-06-28","- 전동휠체어 승, 하차 지원함/    ,   ,   ,     \n- 점심, 저녁 식사 후 양치 지원함/  ,     \n- 08:20 화장실 지원함/  "]
["생활일지","2022-06-29","- 전동휠체어 승, 하차 지원함/    ,   \n- 점심, 저녁 식사 후 양치 지원함/  "]
["생활일지","2022-06-30","- 전동휠체어 승, 하차 지원함/  ,     \n- 점심, 저녁 식사 후 양치 지원함/    ,   "]

{"sheet":"이름지정","index":7,"n_rows":637,"n_cols":5,"rows_kept":637,"cut":false,"hidden":true,"merged":[]}
["년도","월","연도","날짜","휴일명"]
[2010,1,{"$f":"YEAR(D2)","v":2010},"2010-02-13","설날"]
[2011,2,{"$f":"YEAR(D3)","v":2010},"2010-02-14","설날"]
[2012,3,2010,"2010-02-15","설날"]
[2013,4,2010,"2010-05-21","석가탄신일"]
[2014,5,2010,"2010-09-21","추석"]
[2015,6,2010,"2010-09-22","추석"]
[2016,7,2010,"2010-09-23","추석"]
[2017,8,2011,"2011-02-02","설날"]
[2018,9,2011,"2011-02-03","설날"]
[2019,10,2011,"2011-02-04","설날"]
[2020,11,2011,"2011-05-10","석가탄신일"]
[2021,12,2011,"2011-09-11","추석"]
[2022,null,2011,"2011-09-12","추석"]
[2023,null,2011,"2011-09-13","추석"]
[2024,null,2012,"2012-01-22","설날"]
[2025,null,2012,"2012-01-23","설날"]
[2026,null,2012,"2012-01-24","설날"]
[2027,null,2012,"2012-05-28","석가탄신일"]
[2028,null,2012,"2012-09-29","추석"]
[2029,null,2012,"2012-09-30","추석"]
[2030,null,2012,"2012-10-01","추석"]
[2031,null,2013,"2013-02-09","설날"]
[2032,null,2013,"2013-02-10","설날"]
[2033,null,2013,"2013-02-11","설날"]
[2034,null,2013,"2013-05-17","석가탄신일"]
[2035,null,2013,"2013-09-18","추석"]
[2036,null,2013,"2013-09-19","추석"]
[2037,null,2013,"2013-09-20","추석"]
[2038,null,2014,"2014-01-30","설날"]
[2039,null,2014,"2014-01-31","설날"]
[2040,null,2014,"2014-02-01","설날"]
[2041,null,2014,"2014-05-06","석가탄신일"]
[2042,null,2014,"2014-09-07","추석"]
[2043,null,2014,"2014-09-08","추석"]
[2044,null,2014,"2014-09-09","추석"]
[2045,null,2015,"2015-02-18","설날"]
[2046,null,2015,"2015-02-19","설날"]
[2047,null,2015,"2015-02-20","설날"]
[2048,null,2015,"2015-05-25","석가탄신일"]
[2049,null,2015,"2015-09-26","추석"]
[2050,null,2015,"2015-09-27","추석"]
[2051,null,2015,"2015-09-28","추석"]
[2052,null,2016,"2016-02-08","설날"]
[2053,null,2016,"2016-02-09","설날"]
[2054,null,2016,"2016-02-10","설날"]
[2055,null,2016,"2016-05-14","석가탄신일"]
[2056,null,2016,"2016-09-14","추석"]
[2057,null,2016,"2016-09-15","추석"]
[2058,null,2016,"2016-09-16","추석"]
[2059,null,2017,"2017-01-27","설날"]
[2060,null,2017,"2017-01-28","설날"]
[2061,null,2017,"2017-01-29","설날"]
[2062,null,2017,"2017-05-03","석가탄신일"]
[2063,null,2017,"2017-10-03","추석"]
[2064,null,2017,"2017-10-04","추석"]
[2065,null,2017,"2017-10-05","추석"]
[2066,null,2018,"2018-02-15","설날"]
[2067,null,2018,"2018-02-16","설날"]
[2068,null,2018,"2018-02-17","설날"]
[2069,null,2018,"2018-05-22","석가탄신일"]
[2070,null,2018,"2018-09-23","추석"]
[2071,null,2018,"2018-09-24","추석"]
[2072,null,2018,"2018-09-25","추석"]
[2073,null,2019,"2019-02-04","설날"]
[2074,null,2019,"2019-02-05","설날"]
[2075,null,{"$f":"YEAR(D67)","v":2019},"2019-02-06","설날"]
[2076,null,2019,"2019-05-12","석가탄신일"]
[2077,null,2019,"2019-09-12","추석"]
[2078,null,2019,"2019-09-13","추석"]
[2079,null,2019,"2019-09-14","추석"]
[2080,null,2020,"2020-01-24","설날"]
[2081,null,2020,"2020-01-25","설날"]
[2082,null,2020,"2020-01-26","설날"]
[2083,null,2020,"2020-04-30","석가탄신일"]
[2084,null,2020,"2020-09-30","추석"]
[2085,null,2020,"2020-10-01","추석"]
[2086,null,2020,"2020-10-02","추석"]
[2087,null,2021,"2021-02-11","설날"]
[2088,null,2021,"2021-02-12","설날"]
[2089,null,2021,"2021-02-13","설날"]
[2090,null,2021,"2021-05-19","석가탄신일"]
[2091,null,2021,"2021-09-20","추석"]
[2092,null,2021,"2021-09-21","추석"]
[2093,null,2021,"2021-09-22","추석"]
[2094,null,2022,"2022-01-31","설날"]
[2095,null,2022,"2022-02-01","설날"]
[2096,null,2022,"2022-02-02","설날"]
[2097,null,2022,"2022-05-08","석가탄신일"]
[2098,null,2022,"2022-09-09","추석"]
[2099,null,2022,"2022-09-10","추석"]
[2100,null,2022,"2022-09-11","추석"]
[null,null,2023,"2023-01-21","설날"]
[null,null,2023,"2023-01-22","설날"]
[null,null,2023,"2023-01-23","설날"]
[null,null,2023,"2023-05-27","석가탄신일"]
[null,null,2023,"2023-09-28","추석"]
[null,null,2023,"2023-09-29","추석"]
[null,null,2023,"2023-09-30","추석"]
[null,null,2024,"2024-02-09","설날"]
[null,null,2024,"2024-02-10","설날"]
[null,null,2024,"2024-02-11","설날"]
[null,null,2024,"2024-05-15","석가탄신일"]
[null,null,2024,"2024-09-16","추석"]
[null,null,2024,"2024-09-17","추석"]
[null,null,2024,"2024-09-18","추석"]
[null,null,2025,"2025-01-28","설날"]
[null,null,2025,"2025-01-29","설날"]
[null,null,2025,"2025-01-30","설날"]
[null,null,2025,"2025-05-05","석가탄신일"]
[null,null,2025,"2025-10-05","추석"]
[null,null,2025,"2025-10-06","추석"]
[null,null,2025,"2025-10-07","추석"]
[null,null,2026,"2026-02-16","설날"]
[null,null,2026,"2026-02-17","설날"]
[null,null,2026,"2026-02-18","설날"]
[null,null,2026,"2026-05-24","석가탄신일"]
[null,null,2026,"2026-09-24","추석"]
[null,null,2026,"2026-09-25","추석"]
[null,null,2026,"2026-09-26","추석"]
[null,null,2027,"2027-02-06","설날"]
[null,null,2027,"2027-02-07","설날"]
[null,null,2027,"2027-02-08","설날"]
[null,null,2027,"2027-05-13","석가탄신일"]
[null,null,2027,"2027-09-14","추석"]
[null,null,2027,"2027-09-15","추석"]
[null,null,2027,"2027-09-16","추석"]
[null,null,2028,"2028-01-26","설날"]
[null,null,2028,"2028-01-27","설날"]
[null,null,2028,"2028-01-28","설날"]
[null,null,{"$f":"YEAR(D131)","v":2028},"2028-05-02","석가탄신일"]
[null,null,2028,"2028-10-02","추석"]
[null,null,2028,"2028-10-03","추석"]
[null,null,2028,"2028-10-04","추석"]
[null,null,2029,"2029-02-12","설날"]
[null,null,2029,"2029-02-13","설날"]
[null,null,2029,"2029-02-14","설날"]
[null,null,2029,"2029-05-20","석가탄신일"]
[null,null,2029,"2029-09-21","추석"]
[null,null,2029,"2029-09-22","추석"]
[null,null,2029,"2029-09-23","추석"]
[null,null,2030,"2030-02-02","설날"]
[null,null,2030,"2030-02-03","설날"]
[null,null,2030,"2030-02-04","설날"]
[null,null,2030,"2030-05-09","석가탄신일"]
[null,null,2030,"2030-09-11","추석"]
[null,null,2030,"2030-09-12","추석"]
[null,null,2030,"2030-09-13","추석"]
[null,null,2031,"2031-01-22","설날"]
[null,null,2031,"2031-01-23","설날"]
[null,null,2031,"2031-01-24","설날"]
[null,null,2031,"2031-05-28","석가탄신일"]
[null,null,2031,"2031-09-30","추석"]
[null,null,2031,"2031-10-01","추석"]
[null,null,2031,"2031-10-02","추석"]
[null,null,2032,"2032-02-10","설날"]
[null,null,2032,"2032-02-11","설날"]
[null,null,2032,"2032-02-12","설날"]
[null,null,2032,"2032-05-16","석가탄신일"]
[null,null,2032,"2032-09-18","추석"]
[null,null,2032,"2032-09-19","추석"]
[null,null,2032,"2032-09-20","추석"]
[null,null,2033,"2033-01-30","설날"]
[null,null,2033,"2033-01-31","설날"]
[null,null,2033,"2033-02-01","설날"]
[null,null,2033,"2033-05-06","석가탄신일"]
[null,null,2033,"2033-10-06","추석"]
[null,null,2033,"2033-10-07","추석"]
[null,null,2033,"2033-10-08","추석"]
[null,null,2034,"2034-02-18","설날"]
[null,null,2034,"2034-02-19","설날"]
[null,null,2034,"2034-02-20","설날"]
[null,null,2034,"2034-05-25","석가탄신일"]
[null,null,2034,"2034-09-26","추석"]
[null,null,2034,"2034-09-27","추석"]
[null,null,2034,"2034-09-28","추석"]
[null,null,2035,"2035-02-07","설날"]
[null,null,2035,"2035-02-08","설날"]
[null,null,2035,"2035-02-09","설날"]
[null,null,2035,"2035-05-15","석가탄신일"]
[null,null,2035,"2035-09-15","추석"]
[null,null,2035,"2035-09-16","추석"]
[null,null,2035,"2035-09-17","추석"]
[null,null,2036,"2036-01-27","설날"]
[null,null,2036,"2036-01-28","설날"]
[null,null,2036,"2036-01-29","설날"]
[null,null,2036,"2036-05-03","석가탄신일"]
[null,null,2036,"2036-10-03","추석"]
[null,null,2036,"2036-10-04","추석"]
[null,null,2036,"2036-10-05","추석"]
[null,null,2037,"2037-02-14","설날"]
[null,null,2037,"2037-02-15","설날"]
[null,null,2037,"2037-02-16","설날"]
[null,null,2037,"2037-05-22","석가탄신일"]
[null,null,{"$f":"YEAR(D195)","v":2037},"2037-09-23","추석"]
[null,null,2037,"2037-09-24","추석"]
[null,null,2037,"2037-09-25","추석"]
[null,null,2038,"2038-02-03","설날"]
[null,null,2038,"2038-02-04","설날"]
[null,null,2038,"2038-02-05","설날"]
[null,null,2038,"2038-05-11","석가탄신일"]
[null,null,2038,"2038-09-12","추석"]
[null,null,2038,"2038-09-13","추석"]
[null,null,2038,"2038-09-14","추석"]
[null,null,2039,"2039-01-23","설날"]
[null,null,2039,"2039-01-24","설날"]
[null,null,2039,"2039-01-25","설날"]
[null,null,2039,"2039-04-30","석가탄신일"]
[null,null,2039,"2039-10-01","추석"]
[null,null,2039,"2039-10-02","추석"]
[null,null,2039,"2039-10-03","추석"]
[null,null,2040,"2040-02-11","설날"]
[null,null,2040,"2040-02-12","설날"]
[null,null,2040,"2040-02-13","설날"]
[null,null,2040,"2040-05-18","석가탄신일"]
[null,null,2040,"2040-09-20","추석"]
[null,null,2040,"2040-09-21","추석"]
[null,null,2040,"2040-09-22","추석"]
[null,null,2041,"2041-01-31","설날"]
[null,null,2041,"2041-02-01","설날"]
[null,null,2041,"2041-02-02","설날"]
[null,null,2041,"2041-05-07","석가탄신일"]
[null,null,2041,"2041-09-09","추석"]
[null,null,2041,"2041-09-10","추석"]
[null,null,2041,"2041-09-11","추석"]
[null,null,2042,"2042-01-21","설날"]
[null,null,2042,"2042-01-22","설날"]
[null,null,2042,"2042-01-23","설날"]
[null,null,2042,"2042-05-26","석가탄신일"]
[null,null,2042,"2042-09-27","추석"]
[null,null,2042,"2042-09-28","추석"]
[null,null,2042,"2042-09-29","추석"]
[null,null,2043,"2043-02-09","설날"]
[null,null,2043,"2043-02-10","설날"]
[null,null,2043,"2043-02-11","설날"]
[null,null,2043,"2043-05-16","석가탄신일"]
[null,null,2043,"2043-09-16","추석"]
[null,null,2043,"2043-09-17","추석"]
[null,null,2043,"2043-09-18","추석"]
[null,null,2044,"2044-01-29","설날"]
[null,null,2044,"2044-01-30","설날"]
[null,null,2044,"2044-01-31","설날"]
[null,null,2044,"2044-05-05","석가탄신일"]
[null,null,2044,"2044-10-04","추석"]
[null,null,2044,"2044-10-05","추석"]
[null,null,2044,"2044-10-06","추석"]
[null,null,2045,"2045-02-16","설날"]
[null,null,2045,"2045-02-17","설날"]
[null,null,2045,"2045-02-18","설날"]
[null,null,2045,"2045-05-24","석가탄신일"]
[null,null,2045,"2045-09-24","추석"]
[null,null,2045,"2045-09-25","추석"]
[null,null,2045,"2045-09-26","추석"]
[null,null,2046,"2046-02-05","설날"]
[null,null,2046,"2046-02-06","설날"]
[null,null,2046,"2046-02-07","설날"]
[null,null,2046,"2046-05-13","석가탄신일"]
[null,null,2046,"2046-09-14","추석"]
[null,null,{"$f":"YEAR(D259)","v":2046},"2046-09-15","추석"]
[null,null,2046,"2046-09-16","추석"]
[null,null,2047,"2047-01-25","설날"]
[null,null,2047,"2047-01-26","설날"]
[null,null,2047,"2047-01-27","설날"]
[null,null,2047,"2047-05-02","석가탄신일"]
[null,null,2047,"2047-10-04","추석"]
[null,null,2047,"2047-10-05","추석"]
[null,null,2048,"2048-02-13","설날"]
[null,null,2048,"2048-02-14","설날"]
[null,null,2048,"2048-02-15","설날"]
[null,null,2048,"2048-05-20","석가탄신일"]
[null,null,2048,"2048-09-21","추석"]
[null,null,2048,"2048-09-22","추석"]
[null,null,2048,"2048-09-23","추석"]
[null,null,2049,"2049-02-01","설날"]
[null,null,2049,"2049-02-02","설날"]
[null,null,2049,"2049-02-03","설날"]
[null,null,2049,"2049-05-09","석가탄신일"]
[null,null,2049,"2049-09-10","추석"]
[null,null,2049,"2049-09-11","추석"]
[null,null,2049,"2049-09-12","추석"]
[null,null,2050,"2050-01-22","설날"]
[null,null,2050,"2050-01-23","설날"]
[null,null,2050,"2050-01-24","설날"]
[null,null,2050,"2050-05-28","석가탄신일"]
[null,null,2050,"2050-09-29","추석"]
[null,null,2050,"2050-09-30","추석"]
[null,null,2050,"2050-10-01","추석"]
[null,null,2051,"2051-02-10","설날"]
[null,null,2051,"2051-02-11","설날"]
[null,null,2051,"2051-02-12","설날"]
[null,null,2051,"2051-05-17","석가탄신일"]
[null,null,2051,"2051-09-18","추석"]
[null,null,2051,"2051-09-19","추석"]
[null,null,2051,"2051-09-20","추석"]
[null,null,2052,"2052-01-31","설날"]
[null,null,2052,"2052-02-01","설날"]
[null,null,2052,"2052-02-02","설날"]
[null,null,2052,"2052-05-06","석가탄신일"]
[null,null,2052,"2052-09-06","추석"]
[null,null,2052,"2052-09-07","추석"]
[null,null,2052,"2052-09-08","추석"]
[null,null,2053,"2053-02-18","설날"]
[null,null,2053,"2053-02-19","설날"]
[null,null,2053,"2053-02-20","설날"]
[null,null,2053,"2053-05-25","석가탄신일"]
[null,null,2053,"2053-09-25","추석"]
[null,null,2053,"2053-09-26","추석"]
[null,null,2053,"2053-09-27","추석"]
[null,null,2054,"2054-02-07","설날"]
[null,null,2054,"2054-02-08","설날"]
[null,null,2054,"2054-02-09","설날"]
[null,null,2054,"2054-05-15","석가탄신일"]
[null,null,2054,"2054-09-15","추석"]
[null,null,2054,"2054-09-16","추석"]
[null,null,2054,"2054-09-17","추석"]
[null,null,2055,"2055-01-27","설날"]
[null,null,2055,"2055-01-28","설날"]
[null,null,2055,"2055-01-29","설날"]
[null,null,2055,"2055-05-04","석가탄신일"]
[null,null,2055,"2055-10-04","추석"]
[null,null,2055,"2055-10-05","추석"]
[null,null,2055,"2055-10-06","추석"]
[null,null,{"$f":"YEAR(D323)","v":2056},"2056-02-14","설날"]
[null,null,2056,"2056-02-15","설날"]
[null,null,2056,"2056-02-16","설날"]
[null,null,2056,"2056-05-22","석가탄신일"]
[null,null,2056,"2056-09-23","추석"]
[null,null,2056,"2056-09-24","추석"]
[null,null,2056,"2056-09-25","추석"]
[null,null,2057,"2057-02-03","설날"]
[null,null,2057,"2057-02-04","설날"]
[null,null,2057,"2057-02-05","설날"]
[null,null,2057,"2057-05-11","석가탄신일"]
[null,null,2057,"2057-09-12","추석"]
[null,null,2057,"2057-09-13","추석"]
[null,null,2057,"2057-09-14","추석"]
[null,null,2058,"2058-01-23","설날"]
[null,null,2058,"2058-01-24","설날"]
[null,null,2058,"2058-01-25","설날"]
[null,null,2058,"2058-04-30","석가탄신일"]
[null,null,2058,"2058-10-01","추석"]
[null,null,2058,"2058-10-02","추석"]
[null,null,2058,"2058-10-03","추석"]
[null,null,2059,"2059-02-11","설날"]
[null,null,2059,"2059-02-12","설날"]
[null,null,2059,"2059-02-13","설날"]
[null,null,2059,"2059-05-19","석가탄신일"]
[null,null,2059,"2059-09-20","추석"]
[null,null,2059,"2059-09-21","추석"]
[null,null,2059,"2059-09-22","추석"]
[null,null,2060,"2060-02-01","설날"]
[null,null,2060,"2060-02-02","설날"]
[null,null,2060,"2060-02-03","설날"]
[null,null,2060,"2060-05-07","석가탄신일"]
[null,null,2060,"2060-09-08","추석"]
[null,null,2060,"2060-09-09","추석"]
[null,null,2060,"2060-09-10","추석"]
[null,null,2061,"2061-01-21","설날"]
[null,null,2061,"2061-01-22","설날"]
[null,null,2061,"2061-01-23","설날"]
[null,null,2061,"2061-05-26","석가탄신일"]
[null,null,2061,"2061-09-27","추석"]
[null,null,2061,"2061-09-28","추석"]
[null,null,2061,"2061-09-29","추석"]
[null,null,2062,"2062-02-08","설날"]
[null,null,2062,"2062-02-09","설날"]
[null,null,2062,"2062-02-10","설날"]
[null,null,2062,"2062-05-16","석가탄신일"]
[null,null,2062,"2062-09-16","추석"]
[null,null,2062,"2062-09-17","추석"]
[null,null,2062,"2062-09-18","추석"]
[null,null,2063,"2063-01-28","설날"]
[null,null,2063,"2063-01-29","설날"]
[null,null,2063,"2063-01-30","설날"]
[null,null,2063,"2063-05-06","석가탄신일"]
[null,null,2063,"2063-10-05","추석"]
[null,null,2063,"2063-10-06","추석"]
[null,null,2063,"2063-10-07","추석"]
[null,null,2064,"2064-02-16","설날"]
[null,null,2064,"2064-02-17","설날"]
[null,null,2064,"2064-02-18","설날"]
[null,null,2064,"2064-05-23","석가탄신일"]
[null,null,2064,"2064-09-24","추석"]
[null,null,2064,"2064-09-25","추석"]
[null,null,2064,"2064-09-26","추석"]
[null,null,2065,"2065-02-04","설날"]
[null,null,{"$f":"YEAR(D387)","v":2065},"2065-02-05","설날"]
[null,null,2065,"2065-02-06","설날"]
[null,null,2065,"2065-05-12","석가탄신일"]
[null,null,2065,"2065-09-14","추석"]
[null,null,2065,"2065-09-15","추석"]
[null,null,2065,"2065-09-16","추석"]
[null,null,2066,"2066-01-25","설날"]
[null,null,2066,"2066-01-26","설날"]
[null,null,2066,"2066-01-27","설날"]
[null,null,2066,"2066-05-01","석가탄신일"]
[null,null,2066,"2066-10-02","추석"]
[null,null,2066,"2066-10-03","추석"]
[null,null,2066,"2066-10-04","추석"]
[null,null,2067,"2067-02-13","설날"]
[null,null,2067,"2067-02-14","설날"]
[null,null,2067,"2067-02-15","설날"]
[null,null,2067,"2067-05-20","석가탄신일"]
[null,null,2067,"2067-09-22","추석"]
[null,null,2067,"2067-09-23","추석"]
[null,null,2067,"2067-09-24","추석"]
[null,null,2068,"2068-02-02","설날"]
[null,null,2068,"2068-02-03","설날"]
[null,null,2068,"2068-02-04","설날"]
[null,null,2068,"2068-05-09","석가탄신일"]
[null,null,2068,"2068-09-10","추석"]
[null,null,2068,"2068-09-11","추석"]
[null,null,2068,"2068-09-12","추석"]
[null,null,2069,"2069-01-22","설날"]
[null,null,2069,"2069-01-23","설날"]
[null,null,2069,"2069-01-24","설날"]
[null,null,2069,"2069-04-28","석가탄신일"]
[null,null,2069,"2069-09-28","추석"]
[null,null,2069,"2069-09-29","추석"]
[null,null,2069,"2069-09-30","추석"]
[null,null,2070,"2070-02-10","설날"]
[null,null,2070,"2070-02-11","설날"]
[null,null,2070,"2070-02-12","설날"]
[null,null,2070,"2070-05-17","석가탄신일"]
[null,null,2070,"2070-09-18","추석"]
[null,null,2070,"2070-09-19","추석"]
[null,null,2070,"2070-09-20","추석"]
[null,null,2071,"2071-01-30","설날"]
[null,null,2071,"2071-01-31","설날"]
[null,null,2071,"2071-02-01","설날"]
[null,null,2071,"2071-05-07","석가탄신일"]
[null,null,2071,"2071-09-07","추석"]
[null,null,2071,"2071-09-08","추석"]
[null,null,2071,"2071-09-09","추석"]
[null,null,2072,"2072-02-18","설날"]
[null,null,2072,"2072-02-19","설날"]
[null,null,2072,"2072-02-20","설날"]
[null,null,2072,"2072-05-25","석가탄신일"]
[null,null,2072,"2072-09-25","추석"]
[null,null,2072,"2072-09-26","추석"]
[null,null,2072,"2072-09-27","추석"]
[null,null,2073,"2073-02-06","설날"]
[null,null,2073,"2073-02-07","설날"]
[null,null,2073,"2073-02-08","설날"]
[null,null,2073,"2073-05-14","석가탄신일"]
[null,null,2073,"2073-09-15","추석"]
[null,null,2073,"2073-09-16","추석"]
[null,null,2073,"2073-09-17","추석"]
[null,null,2074,"2074-01-26","설날"]
[null,null,2074,"2074-01-27","설날"]
[null,null,{"$f":"YEAR(D451)","v":2074},"2074-01-28","설날"]
[null,null,2074,"2074-05-03","석가탄신일"]
[null,null,2074,"2074-10-04","추석"]
[null,null,2074,"2074-10-05","추석"]
[null,null,2074,"2074-10-06","추석"]
[null,null,2075,"2075-02-14","설날"]
[null,null,2075,"2075-02-15","설날"]
[null,null,2075,"2075-02-16","설날"]
[null,null,2075,"2075-05-22","석가탄신일"]
[null,null,2075,"2075-09-23","추석"]
[null,null,2075,"2075-09-24","추석"]
[null,null,2075,"2075-09-25","추석"]
[null,null,2076,"2076-02-04","설날"]
[null,null,2076,"2076-02-05","설날"]
[null,null,2076,"2076-02-06","설날"]
[null,null,2076,"2076-05-10","석가탄신일"]
[null,null,2076,"2076-09-11","추석"]
[null,null,2076,"2076-09-12","추석"]
[null,null,2076,"2076-09-13","추석"]
[null,null,2077,"2077-01-23","설날"]
[null,null,2077,"2077-01-24","설날"]
[null,null,2077,"2077-01-25","설날"]
[null,null,2077,"2077-04-30","석가탄신일"]
[null,null,2077,"2077-09-30","추석"]
[null,null,2077,"2077-10-01","추석"]
[null,null,2077,"2077-10-02","추석"]
[null,null,2078,"2078-02-11","설날"]
[null,null,2078,"2078-02-12","설날"]
[null,null,2078,"2078-02-13","설날"]
[null,null,2078,"2078-05-19","석가탄신일"]
[null,null,2078,"2078-09-19","추석"]
[null,null,2078,"2078-09-20","추석"]
[null,null,2078,"2078-09-21","추석"]
[null,null,2079,"2079-02-01","설날"]
[null,null,2079,"2079-02-02","설날"]
[null,null,2079,"2079-02-03","설날"]
[null,null,2079,"2079-05-08","석가탄신일"]
[null,null,2079,"2079-09-09","추석"]
[null,null,2079,"2079-09-10","추석"]
[null,null,2079,"2079-09-11","추석"]
[null,null,2080,"2080-01-21","설날"]
[null,null,2080,"2080-01-22","설날"]
[null,null,2080,"2080-01-23","설날"]
[null,null,2080,"2080-05-26","석가탄신일"]
[null,null,2080,"2080-09-27","추석"]
[null,null,2080,"2080-09-28","추석"]
[null,null,2080,"2080-09-29","추석"]
[null,null,2081,"2081-02-08","설날"]
[null,null,2081,"2081-02-09","설날"]
[null,null,2081,"2081-02-10","설날"]
[null,null,2081,"2081-05-16","석가탄신일"]
[null,null,2081,"2081-09-16","추석"]
[null,null,2081,"2081-09-17","추석"]
[null,null,2081,"2081-09-18","추석"]
[null,null,2082,"2082-01-28","설날"]
[null,null,2082,"2082-01-29","설날"]
[null,null,2082,"2082-01-30","설날"]
[null,null,2082,"2082-05-05","석가탄신일"]
[null,null,2082,"2082-10-05","추석"]
[null,null,2082,"2082-10-06","추석"]
[null,null,2082,"2082-10-07","추석"]
[null,null,2083,"2083-02-16","설날"]
[null,null,2083,"2083-02-17","설날"]
[null,null,2083,"2083-02-18","설날"]
[null,null,{"$f":"YEAR(D515)","v":2083},"2083-05-24","석가탄신일"]
[null,null,2083,"2083-09-25","추석"]
[null,null,2083,"2083-09-26","추석"]
[null,null,2083,"2083-09-27","추석"]
[null,null,2084,"2084-02-05","설날"]
[null,null,2084,"2084-02-06","설날"]
[null,null,2084,"2084-02-07","설날"]
[null,null,2084,"2084-05-12","석가탄신일"]
[null,null,2084,"2084-09-13","추석"]
[null,null,2084,"2084-09-14","추석"]
[null,null,2084,"2084-09-15","추석"]
[null,null,2085,"2085-01-25","설날"]
[null,null,2085,"2085-01-26","설날"]
[null,null,2085,"2085-01-27","설날"]
[null,null,2085,"2085-05-01","석가탄신일"]
[null,null,2085,"2085-10-02","추석"]
[null,null,2085,"2085-10-03","추석"]
[null,null,2085,"2085-10-04","추석"]
[null,null,2086,"2086-02-13","설날"]
[null,null,2086,"2086-02-14","설날"]
[null,null,2086,"2086-02-15","설날"]
[null,null,2086,"2086-05-20","석가탄신일"]
[null,null,2086,"2086-09-21","추석"]
[null,null,2086,"2086-09-22","추석"]
[null,null,2086,"2086-09-23","추석"]
[null,null,2087,"2087-02-02","설날"]
[null,null,2087,"2087-02-03","설날"]
[null,null,2087,"2087-02-04","설날"]
[null,null,2087,"2087-05-10","석가탄신일"]
[null,null,2087,"2087-09-10","추석"]
[null,null,2087,"2087-09-11","추석"]
[null,null,2087,"2087-09-12","추석"]
[null,null,2088,"2088-01-23","설날"]
[null,null,2088,"2088-01-24","설날"]
[null,null,2088,"2088-01-25","설날"]
[null,null,2088,"2088-04-28","석가탄신일"]
[null,null,2088,"2088-09-28","추석"]
[null,null,2088,"2088-09-29","추석"]
[null,null,2088,"2088-09-30","추석"]
[null,null,2089,"2089-02-10","설날"]
[null,null,2089,"2089-02-11","설날"]
[null,null,2089,"2089-02-12","설날"]
[null,null,2089,"2089-05-17","석가탄신일"]
[null,null,2089,"2089-09-18","추석"]
[null,null,2089,"2089-09-19","추석"]
[null,null,2089,"2089-09-20","추석"]
[null,null,2090,"2090-01-29","설날"]
[null,null,2090,"2090-01-30","설날"]
[null,null,2090,"2090-01-31","설날"]
[null,null,2090,"2090-05-07","석가탄신일"]
[null,null,2090,"2090-09-07","추석"]
[null,null,2090,"2090-09-08","추석"]
[null,null,2090,"2090-09-09","추석"]
[null,null,2091,"2091-02-17","설날"]
[null,null,2091,"2091-02-18","설날"]
[null,null,2091,"2091-02-19","설날"]
[null,null,2091,"2091-05-25","석가탄신일"]
[null,null,2091,"2091-09-26","추석"]
[null,null,2091,"2091-09-27","추석"]
[null,null,2091,"2091-09-28","추석"]
[null,null,2092,"2092-02-06","설날"]
[null,null,2092,"2092-02-07","설날"]
[null,null,2092,"2092-02-08","설날"]
[null,null,2092,"2092-05-13","석가탄신일"]
[null,null,{"$f":"YEAR(D579)","v":2092},"2092-09-15","추석"]
[null,null,2092,"2092-09-16","추석"]
[null,null,2092,"2092-09-17","추석"]
[null,null,2093,"2093-01-26","설날"]
[null,null,2093,"2093-01-27","설날"]
[null,null,2093,"2093-01-28","설날"]
[null,null,2093,"2093-05-03","석가탄신일"]
[null,null,2093,"2093-10-04","추석"]
[null,null,2093,"2093-10-05","추석"]
[null,null,2093,"2093-10-06","추석"]
[null,null,2094,"2094-02-14","설날"]
[null,null,2094,"2094-02-15","설날"]
[null,null,2094,"2094-02-16","설날"]
[null,null,2094,"2094-05-21","석가탄신일"]
[null,null,2094,"2094-09-23","추석"]
[null,null,2094,"2094-09-24","추석"]
[null,null,2094,"2094-09-25","추석"]
[null,null,2095,"2095-02-04","설날"]
[null,null,2095,"2095-02-05","설날"]
[null,null,2095,"2095-02-06","설날"]
[null,null,2095,"2095-05-11","석가탄신일"]
[null,null,2095,"2095-09-12","추석"]
[null,null,2095,"2095-09-13","추석"]
[null,null,2095,"2095-09-14","추석"]
[null,null,2096,"2096-01-24","설날"]
[null,null,2096,"2096-01-25","설날"]
[null,null,2096,"2096-01-26","설날"]
[null,null,2096,"2096-04-30","석가탄신일"]
[null,null,2096,"2096-09-30","추석"]
[null,null,2096,"2096-10-01","추석"]
[null,null,2096,"2096-10-02","추석"]
[null,null,2097,"2097-02-11","설날"]
[null,null,2097,"2097-02-12","설날"]
[null,null,2097,"2097-02-13","설날"]
[null,null,2097,"2097-05-19","석가탄신일"]
[null,null,2097,"2097-09-19","추석"]
[null,null,2097,"2097-09-20","추석"]
[null,null,2097,"2097-09-21","추석"]
[null,null,2098,"2098-01-31","설날"]
[null,null,2098,"2098-02-01","설날"]
[null,null,2098,"2098-02-02","설날"]
[null,null,2098,"2098-05-08","석가탄신일"]
[null,null,2098,"2098-09-09","추석"]
[null,null,2098,"2098-09-10","추석"]
[null,null,2098,"2098-09-11","추석"]
[null,null,2099,"2099-01-20","설날"]
[null,null,2099,"2099-01-21","설날"]
[null,null,2099,"2099-01-22","설날"]
[null,null,2099,"2099-05-27","석가탄신일"]
[null,null,2099,"2099-09-28","추석"]
[null,null,2099,"2099-09-29","추석"]
[null,null,2099,"2099-09-30","추석"]
[null,null,2100,"2100-02-08","설날"]
[null,null,2100,"2100-02-09","설날"]
[null,null,2100,"2100-02-10","설날"]
[null,null,2100,"2100-05-16","석가탄신일"]
[null,null,2100,"2100-09-17","추석"]
[null,null,2100,"2100-09-18","추석"]
[null,null,2100,"2100-09-19","추석"]