{"text_format":"1","workbook":"xlsx","n_sheets":8,"sheets":["사용안내","연간","달력","일정","공휴일","디데이","예제 파일","이름지정"],"not_rendered":{"charts":0,"images":2,"macros":1,"external_links":0,"defined_names":20,"comments":3,"pivot_tables":0},"unopened":[],"bounds":{"document_bytes":16777216,"sheet_cells":100000,"rows_first":2000,"rows_last":500,"rows_between":2000,"halvings":0,"cell_chars":16384,"cell_head_chars":4096},"cells_cut":0,"cells_raw":0,"read":"whole","date_system":"1900"}

{"sheet":"사용안내","index":0,"n_rows":30,"n_cols":7,"rows_kept":30,"cut":false,"hidden":false,"merged":[[0,1,0,10],[17,1,17,10],[6,1,6,5],[6,6,6,10],[7,1,7,5],[8,1,8,5],[9,1,9,5],[10,1,10,5],[2,1,2,10],[3,1,3,10],[4,1,4,10],[7,6,7,10],[8,6,8,10],[9,6,9,10],[10,6,10,10],[11,6,11,10],[28,1,28,10],[29,1,29,10],[13,1,13,10],[14,1,14,10],[15,1,15,10],[20,1,20,10],[22,1,22,10],[23,1,23,10],[24,1,24,10],[25,1,25,10],[27,1,27,10],[19,1,19,10],[18,1,18,10]]}
[null,"탭다 엑셀 양식 사용 안내"]
[]
[null,"탭다 블로그 내 엑셀 양식은"]
[null,"사용 범위를 준수할 경우 모두 무료입니다. "]
[null,"금지 사항 적발 시 관련법에 의거 제재 및 법적 처벌을 받을 수 있습니다."]
[]
[null,"O",null,null,null,null,"X"]
[null,"개인적 비상업적 용도의 사용",null,null,null,null,"디자인 무단 도용 및 판매 금지"]
[null,"온라인 및 오프라인 이용 가능",null,null,null,null,"재배포(개인적, 비상업적 용도라도) 금지"]
[null,"회사원 개인의 회사 내부 보고, 제출, 공유용",null,null,null,null,"외부 유출, 대외적 게시 금지"]
{"$rows_left_out":21}
{"sheet":"연간","index":1,"n_rows":32,"n_cols":32,"rows_kept":32,"cut":false,"hidden":false,"merged":[[1,14,1,18]]}
[]
[null,"S",null,null,null,null,null,null,null,null,null,null,null,null,2022]
[]
[null,null,null,null,1,null,null,null,null,null,null,null,2,null,null,null,null,null,null,null,3,null,null,null,null,null,null,null,4]
[]
[null,{"$f":"IF($B$2=\"S\",\"S\",IF($B$2=\"M\",\"M\"))","v":"S"},{"$f":"IF($B$2=\"S\",\"M\",IF($B$2=\"M\",\"T\"))","v":"M"},{"$f":"IF($B$2=\"S\",\"T\",IF($B$2=\"M\",\"W\"))","v":"T"},{"$f":"IF($B$2=\"S\",\"W\",IF($B$2=\"M\",\"T\"))","v":"W"},{"$f":"IF($B$2=\"S\",\"T\",IF($B$2=\"M\",\"F\"))","v":"T"},{"$f":"IF($B$2=\"S\",\"F\",IF($B$2=\"M\",\"S\"))","v":"F"},"S",null,{"$f":"IF($B$2=\"S\",\"S\",IF($B$2=\"M\",\"M\"))","v":"S"},{"$f":"IF($B$2=\"S\",\"M\",IF($B$2=\"M\",\"T\"))","v":"M"},{"$f":"IF($B$2=\"S\",\"T\",IF($B$2=\"M\",\"W\"))","v":"T"},{"$f":"IF($B$2=\"S\",\"W\",IF($B$2=\"M\",\"T\"))","v":"W"},{"$f":"IF($B$2=\"S\",\"T\",IF($B$2=\"M\",\"F\"))","v":"T"},{"$f":"IF($B$2=\"S\",\"F\",IF($B$2=\"M\",\"S\"))","v":"F"},"S",null,{"$f":"IF($B$2=\"S\",\"S\",IF($B$2=\"M\",\"M\"))","v":"S"},{"$f":"IF($B$2=\"S\",\"M\",IF($B$2=\"M\",\"T\"))","v":"M"},{"$f":"IF($B$2=\"S\",\"T\",IF($B$2=\"M\",\"W\"))","v":"T"},{"$f":"IF($B$2=\"S\",\"W\",IF($B$2=\"M\",\"T\"))","v":"W"},{"$f":"IF($B$2=\"S\",\"T\",IF($B$2=\"M\",\"F\"))","v":"T"},{"$f":"IF($B$2=\"S\",\"F\",IF($B$2=\"M\",\"S\"))","v":"F"},"S",null,{"$f":"IF($B$2=\"S\",\"S\",IF($B$2=\"M\",\"M\"))","v":"S"},{"$f":"IF($B$2=\"S\",\"M\",IF($B$2=\"M\",\"T\"))","v":"M"},{"$f":"IF($B$2=\"S\",\"T\",IF($B$2=\"M\",\"W\"))","v":"T"},{"$f":"IF($B$2=\"S\",\"W\",IF($B$2=\"M\",\"T\"))","v":"W"},{"$f":"IF($B$2=\"S\",\"T\",IF($B$2=\"M\",\"F\"))","v":"T"},{"$f":"IF($B$2=\"S\",\"F\",IF($B$2=\"M\",\"S\"))","v":"F"},"S"]
[null,{"$f":"IF(B2=\"M\",(IF(DAY(DATE($O$2,$E$4,1)-WEEKDAY(DATE($O$2,$E$4,1))+2)=2,DATE($O$2,$E$4,1)-WEEKDAY(DATE($O$2,$E$4,1))-5,DATE($O$2,$E$4,1)-WEEKDAY(DATE($O$2,$E$4,1))+2)),IF(B2=\"S\",DATE($O$2,$E$4,1)-WEEKDAY(DATE($O$2,$E$4,1))+1))","v":"2021-12-26"},{"$f":"B7+1","v":"2021-12-27"},"2021-12-28","2021-12-29","2021-12-30","2021-12-31","2022-01-01",null,{"$f":"IF(B2=\"M\",(IF(DAY(DATE($O$2,$M$4,1)-WEEKDAY(DATE($O$2,$M$4,1))+2)=2,DATE($O$2,$M$4,1)-WEEKDAY(DATE($O$2,$M$4,1))-5,DATE($O$2,$M$4,1)-WEEKDAY(DATE($O$2,$M$4,1))+2)),IF(B2=\"S\",DATE($O$2,$M$4,1)-WEEKDAY(DATE($O$2,$M$4,1))+1))","v":"2022-01-30"},{"$f":"J7+1","v":"2022-01-31"},"2022-02-01","2022-02-02","2022-02-03","2022-02-04","2022-02-05",null,{"$f":"IF(B2=\"M\",(IF(DAY(DATE($O$2,$U$4,1)-WEEKDAY(DATE($O$2,$U$4,1))+2)=2,DATE($O$2,$U$4,1)-WEEKDAY(DATE($O$2,$U$4,1))-5,DATE($O$2,$U$4,1)-WEEKDAY(DATE($O$2,$U$4,1))+2)),IF(B2=\"S\",DATE($O$2,$U$4,1)-WEEKDAY(DATE($O$2,$U$4,1))+1))","v":"2022-02-27"},{"$f":"R7+1","v":"2022-02-28"},"2022-03-01","2022-03-02","2022-03-03","2022-03-04","2022-03-05",null,{"$f":"IF(B2=\"M\",(IF(DAY(DATE($O$2,$AC$4,1)-WEEKDAY(DATE($O$2,$AC$4,1))+2)=2,DATE($O$2,$AC$4,1)-WEEKDAY(DATE($O$2,$AC$4,1))-5,DATE($O$2,$AC$4,1)-WEEKDAY(DATE($O$2,$AC$4,1))+2)),IF(B2=\"S\",DATE($O$2,$AC$4,1)-WEEKDAY(DATE($O$2,$AC$4,1))+1))","v":"2022-03-27"},{"$f":"Z7+1","v":"2022-03-28"},"2022-03-29","2022-03-30","2022-03-31","2022-04-01","2022-04-02"]
[null,{"$f":"B7+7","v":"2022-01-02"},{"$f":"C7+7","v":"2022-01-03"},"2022-01-04","2022-01-05","2022-01-06","2022-01-07","2022-01-08",null,{"$f":"J7+7","v":"2022-02-06"},"2022-02-07","2022-02-08","2022-02-09","2022-02-10","2022-02-11","2022-02-12",null,{"$f":"R7+7","v":"2022-03-06"},"2022-03-07","2022-03-08","2022-03-09","2022-03-10","2022-03-11","2022-03-12",null,{"$f":"Z7+7","v":"2022-04-03"},"2022-04-04","2022-04-05","2022-04-06","2022-04-07","2022-04-08","2022-04-09"]
[null,{"$f":"B8+7","v":"2022-01-09"},"2022-01-10","2022-01-11","2022-01-12","2022-01-13","2022-01-14","2022-01-15",null,"2022-02-13","2022-02-14","2022-02-15","2022-02-16","2022-02-17","2022-02-18","2022-02-19",null,"2022-03-13","2022-03-14","2022-03-15","2022-03-16","2022-03-17","2022-03-18","2022-03-19",null,"2022-04-10","2022-04-11","2022-04-12","2022-04-13","2022-04-14","2022-04-15","2022-04-16"]
[null,{"$f":"B9+7","v":"2022-01-16"},"2022-01-17","2022-01-18","2022-01-19","2022-01-20","2022-01-21","2022-01-22",null,"2022-02-20","2022-02-21","2022-02-22","2022-02-23","2022-02-24","2022-02-25","2022-02-26",null,"2022-03-20","2022-03-21","2022-03-22","2022-03-23","2022-03-24","2022-03-25","2022-03-26",null,"2022-04-17","2022-04-18","2022-04-19","2022-04-20","2022-04-21","2022-04-22","2022-04-23"]
{"$rows_left_out":23}
{"sheet":"달력","index":2,"n_rows":4948,"n_cols":36,"rows_kept":4948,"cut":false,"hidden":false,"merged":[[37,3,37,4],[38,3,38,4],[39,3,39,4],[40,3,40,4],[40,1,40,2],[39,1,39,2],[38,1,38,2],[37,1,37,2],[40,9,40,10],[39,9,39,10],[38,9,38,10],[37,9,37,10],[37,7,37,8],[38,7,38,8],[39,7,39,8],[40,7,40,8],[40,5,40,6],[39,5,39,6],[38,5,38,6],[37,5,37,6],[41,11,41,12],[41,13,41,14],[40,13,40,14],[39,13,39,14],[38,13,38,14],[37,13,37,14],[37,11,37,12],[38,11,38,12],[39,11,39,12],[40,11,40,12],[7,3,7,4],[7,5,7,6],[7,7,7,8],[7,9,7,10],[7,11,7,12],[7,13,7,14],[5,1,5,2],[5,3,5,4],[1,1,3,2],[5,11,5,12],[5,9,5,10],[5,13,5,14],[5,5,5,6],[5,7,5,8],[1,9,1,14],[2,9,2,14],[3,9,3,14],[2,3,3,3],[7,1,7,2],[8,13,8,14],[9,1,9,2],[9,3,9,4],[9,5,9,6],[9,7,9,8],[9,9,9,10],[9,11,9,12],[9,13,9,14],[8,1,8,2],[8,3,8,4],[8,5,8,6],[8,7,8,8],[8,9,8,10],[8,11,8,12],[10,13,10,14],[11,1,11,2],[11,3,11,4],[11,5,11,6],[11,7,11,8],[11,9,11,10],[11,11,11,12],[11,13,11,14],[10,1,10,2],[10,3,10,4],[10,5,10,6],[10,7,10,8],[10,9,10,10],[10,11,10,12],[13,13,13,14],[14,1,14,2],[14,3,14,4],[14,5,14,6],[14,7,14,8],[14,9,14,10],[14,11,14,12],[14,13,14,14],[13,1,13,2],[13,3,13,4],[13,5,13,6],[13,7,13,8],[13,9,13,10],[13,11,13,12],[15,13,15,14],[16,1,16,2],[16,3,16,4],[16,5,16,6],[16,7,16,8],[16,9,16,10],[16,11,16,12],[16,13,16,14],[15,1,15,2],[15,3,15,4],[15,5,15,6],[15,7,15,8],[15,9,15,10],[15,11,15,12],[17,13,17,14],[19,1,19,2],[19,3,19,4],[19,5,19,6],[19,7,19,8],[19,9,19,10],[19,11,19,12],[19,13,19,14],[17,1,17,2],[17,3,17,4],[17,5,17,6],[17,7,17,8],[17,9,17,10],[17,11,17,12],[20,13,20,14],[21,1,21,2],[21,3,21,4],[21,5,21,6],[21,7,21,8],[21,9,21,10],[21,11,21,12],[21,13,21,14],[20,1,20,2],[20,3,20,4],[20,5,20,6],[20,7,20,8],[20,9,20,10],[20,11,20,12],[22,13,22,14],[23,1,23,2],[23,3,23,4],[23,5,23,6],[23,7,23,8],[23,9,23,10],[23,11,23,12],[23,13,23,14],[22,1,22,2],[22,3,22,4],[22,5,22,6],[22,7,22,8],[22,9,22,10],[22,11,22,12],[25,13,25,14],[26,1,26,2],[26,3,26,4],[26,5,26,6],[26,7,26,8],[26,9,26,10],[26,11,26,12],[26,13,26,14],[25,1,25,2],[25,3,25,4],[25,5,25,6],[25,7,25,8],[25,9,25,10],[25,11,25,12],[27,13,27,14],[28,1,28,2],[28,3,28,4],[28,5,28,6],[28,7,28,8],[28,9,28,10],[28,11,28,12],[28,13,28,14],[27,1,27,2],[27,3,27,4],[27,5,27,6],[27,7,27,8],[27,9,27,10],[27,11,27,12],[29,13,29,14],[31,1,31,2],[31,3,31,4],[31,5,31,6],[31,7,31,8],[31,9,31,10],[31,11,31,12],[31,13,31,14],[29,1,29,2],[29,3,29,4],[29,5,29,6],[29,7,29,8],[29,9,29,10],[29,11,29,12],[32,13,32,14],[33,1,33,2],[33,3,33,4],[33,5,33,6],[33,7,33,8],[33,9,33,10],[33,11,33,12],[33,13,33,14],[32,1,32,2],[32,3,32,4],[32,5,32,6],[32,7,32,8],[32,9,32,10],[32,11,32,12],[49,11,49,12],[49,13,49,14],[50,11,50,12],[50,13,50,14],[52,11,52,14],[34,13,34,14],[35,1,35,2],[35,3,35,4],[35,5,35,6],[35,7,35,8],[35,9,35,10],[35,11,35,12],[35,13,35,14],[34,1,34,2],[34,3,34,4],[34,5,34,6],[34,7,34,8],[34,9,34,10],[34,11,34,12],[41,1,41,2],[41,3,41,4],[41,5,41,6],[41,7,41,8],[41,9,41,10]]}
[]
[null,5,null,{"$f":"연간!$O$2","v":2022}]
[null,null,null,{"$f":"TEXT(DATE(D2,B2,1),\"mmmm\")","v":"May"}]
[null,null,null,null,null,null,null,null,null,"MADE BY 엠키(tabda.tistory.com)"]
[null,null,null,null,null,null,null,null,null,null,null,null,null,null,null,null,null,"↑클릭 전 주의해주세요!"]
[null,{"$f":"IF(연간!$B$2=\"S\",\"SUN\",IF(연간!$B$2=\"M\",\"MON\"))","v":"SUN"},null,{"$f":"IF(연간!$B$2=\"S\",\"MON\",IF(연간!$B$2=\"M\",\"TUE\"))","v":"MON"},null,{"$f":"IF(연간!$B$2=\"S\",\"TUE\",IF(연간!$B$2=\"M\",\"WED\"))","v":"TUE"},null,{"$f":"IF(연간!$B$2=\"S\",\"WED\",IF(연간!$B$2=\"M\",\"THU\"))","v":"WED"},null,{"$f":"IF(연간!$B$2=\"S\",\"THU\",IF(연간!$B$2=\"M\",\"FRI\"))","v":"THU"},null,{"$f":"IF(연간!$B$2=\"S\",\"FRI\",IF(연간!$B$2=\"M\",\"SAT\"))","v":"FRI"},null,{"$f":"IF(연간!$B$2=\"S\",\"SAT\",IF(연간!$B$2=\"M\",\"SUN\"))","v":"SAT"}]
[null,{"$f":"IFERROR(INDEX(공휴일이름,MATCH(1,--($B$2=공휴일월)*(DAY(C7)=공휴일일),0)),\"\")","v":""},{"$f":"IF(연간!$B$2=\"M\",(IF(DAY(DATE($D$2,$B$2,1)-WEEKDAY(DATE($D$2,$B$2,1))+2)=2,DATE($D$2,$B$2,1)-WEEKDAY(DATE($D$2,$B$2,1))-5,DATE($D$2,$B$2,1)-WEEKDAY(DATE($D$2,$B$2,1))+2)),IF(연간!$B$2=\"S\",DATE($D$2,$B$2,1)-WEEKDAY(DATE($D$2,$B$2,1))+1))","v":"2022-05-01"},{"$f":"IFERROR(INDEX(공휴일이름,MATCH(1,--($B$2=공휴일월)*(DAY(E7)=공휴일일),0)),\"\")","v":""},{"$f":"C7+1","v":"2022-05-02"},{"$f":"IFERROR(INDEX(공휴일이름,MATCH(1,--($B$2=공휴일월)*(DAY(G7)=공휴일일),0)),\"\")","v":""},{"$f":"C7+2","v":"2022-05-03"},{"$f":"IFERROR(INDEX(공휴일이름,MATCH(1,--($B$2=공휴일월)*(DAY(I7)=공휴일일),0)),\"\")","v":""},{"$f":"C7+3","v":"2022-05-04"},{"$f":"IFERROR(INDEX(공휴일이름,MATCH(1,--($B$2=공휴일월)*(DAY(K7)=공휴일일),0)),\"\")","v":"어린이날"},{"$f":"C7+4","v":"2022-05-05"},{"$f":"IFERROR(INDEX(공휴일이름,MATCH(1,--($B$2=공휴일월)*(DAY(M7)=공휴일일),0)),\"\")","v":""},{"$f":"C7+5","v":"2022-05-06"},{"$f":"IFERROR(INDEX(공휴일이름,MATCH(1,--($B$2=공휴일월)*(DAY(O7)=공휴일일),0)),\"\")","v":""},{"$f":"C7+6","v":"2022-05-07"}]
[null,{"$f":"IF(MONTH(C7)<>$B$2,\"\",IF(VLOOKUP(C7,일정,2,0)=0,\"\",VLOOKUP(C7,일정,2,0)))","v":""},null,{"$f":"IF(MONTH(E7)<>$B$2,\"\",IF(VLOOKUP(E7,일정!$B$6:$L$371,2,0)=0,\"\",VLOOKUP(E7,일정!$B$6:$L$371,2,0)))","v":""},null,{"$f":"IF(MONTH(G7)<>$B$2,\"\",IF(VLOOKUP(G7,일정!$B$6:$L$371,2,0)=0,\"\",VLOOKUP(G7,일정!$B$6:$L$371,2,0)))","v":""},null,{"$f":"IF(MONTH(I7)<>$B$2,\"\",IF(VLOOKUP(I7,일정!$B$6:$L$371,2,0)=0,\"\",VLOOKUP(I7,일정!$B$6:$L$371,2,0)))","v":""},null,{"$f":"IF(MONTH(K7)<>$B$2,\"\",IF(VLOOKUP(K7,일정!$B$6:$L$371,2,0)=0,\"\",VLOOKUP(K7,일정!$B$6:$L$371,2,0)))","v":""},null,{"$f":"IF(MONTH(M7)<>$B$2,\"\",IF(VLOOKUP(M7,일정!$B$6:$L$371,2,0)=0,\"\",VLOOKUP(M7,일정!$B$6:$L$371,2,0)))","v":""},null,{"$f":"IF(MONTH(O7)<>$B$2,\"\",IF(VLOOKUP(O7,일정!$B$6:$L$371,2,0)=0,\"\",VLOOKUP(O7,일정!$B$6:$L$371,2,0)))","v":""},null,null,null,null,null,null,null,null,null,{"$f":"IF(MONTH(C7)<>$B$2,\"\",IF(VLOOKUP(C7,일정!$B$6:$L$371,3,0)=0,\"\",VLOOKUP(C7,일정!$B$6:$L$371,3,0)))","v":""},null,{"$f":"IF(MONTH(E7)<>$B$2,\"\",IF(VLOOKUP(E7,일정!$B$6:$L$371,3,0)=0,\"\",VLOOKUP(E7,일정!$B$6:$L$371,3,0)))","v":""},null,{"$f":"IF(MONTH(G7)<>$B$2,\"\",IF(VLOOKUP(G7,일정!$B$6:$L$371,3,0)=0,\"\",VLOOKUP(G7,일정!$B$6:$L$371,3,0)))","v":""},null,{"$f":"IF(MONTH(I7)<>$B$2,\"\",IF(VLOOKUP(I7,일정!$B$6:$L$371,3,0)=0,\"\",VLOOKUP(I7,일정!$B$6:$L$371,3,0)))","v":""},null,{"$f":"IF(MONTH(K7)<>$B$2,\"\",IF(VLOOKUP(K7,일정!$B$6:$L$371,3,0)=0,\"\",VLOOKUP(K7,일정!$B$6:$L$371,3,0)))","v":""},null,{"$f":"IF(MONTH(M7)<>$B$2,\"\",IF(VLOOKUP(M7,일정!$B$6:$L$371,3,0)=0,\"\",VLOOKUP(M7,일정!$B$6:$L$371,3,0)))","v":""},null,{"$f":"IF(MONTH(O7)<>$B$2,\"\",IF(VLOOKUP(O7,일정!$B$6:$L$371,3,0)=0,\"\",VLOOKUP(O7,일정!$B$6:$L$371,3,0)))","v":""}]
[null,{"$f":"IF(MONTH(C7)<>$B$2,\"\",IF(VLOOKUP(C7,일정!$B$6:$L$371,4,0)=0,\"\",VLOOKUP(C7,일정!$B$6:$L$371,4,0)))","v":""},null,{"$f":"IF(MONTH(E7)<>$B$2,\"\",IF(VLOOKUP(E7,일정!$B$6:$L$371,4,0)=0,\"\",VLOOKUP(E7,일정!$B$6:$L$371,4,0)))","v":""},null,{"$f":"IF(MONTH(G7)<>$B$2,\"\",IF(VLOOKUP(G7,일정!$B$6:$L$371,4,0)=0,\"\",VLOOKUP(G7,일정!$B$6:$L$371,4,0)))","v":""},null,{"$f":"IF(MONTH(I7)<>$B$2,\"\",IF(VLOOKUP(I7,일정!$B$6:$L$371,4,0)=0,\"\",VLOOKUP(I7,일정!$B$6:$L$371,4,0)))","v":""},null,{"$f":"IF(MONTH(K7)<>$B$2,\"\",IF(VLOOKUP(K7,일정!$B$6:$L$371,4,0)=0,\"\",VLOOKUP(K7,일정!$B$6:$L$371,4,0)))","v":""},null,{"$f":"IF(MONTH(M7)<>$B$2,\"\",IF(VLOOKUP(M7,일정!$B$6:$L$371,4,0)=0,\"\",VLOOKUP(M7,일정!$B$6:$L$371,4,0)))","v":""},null,{"$f":"IF(MONTH(O7)<>$B$2,\"\",IF(VLOOKUP(O7,일정!$B$6:$L$371,4,0)=0,\"\",VLOOKUP(O7,일정!$B$6:$L$371,4,0)))","v":""},null,null,null,null,null,null,null,null,null,{"$f":"IF(MONTH(C7)<>$B$2,\"\",IF(VLOOKUP(C7,일정!$B$6:$L$371,5,0)=0,\"\",VLOOKUP(C7,일정!$B$6:$L$371,5,0)))","v":""},null,{"$f":"IF(MONTH(E7)<>$B$2,\"\",IF(VLOOKUP(E7,일정!$B$6:$L$371,5,0)=0,\"\",VLOOKUP(E7,일정!$B$6:$L$371,5,0)))","v":""},null,{"$f":"IF(MONTH(G7)<>$B$2,\"\",IF(VLOOKUP(G7,일정!$B$6:$L$371,5,0)=0,\"\",VLOOKUP(G7,일정!$B$6:$L$371,5,0)))","v":""},null,{"$f":"IF(MONTH(I7)<>$B$2,\"\",IF(VLOOKUP(I7,일정!$B$6:$L$371,5,0)=0,\"\",VLOOKUP(I7,일정!$B$6:$L$371,5,0)))","v":""},null,{"$f":"IF(MONTH(K7)<>$B$2,\"\",IF(VLOOKUP(K7,일정!$B$6:$L$371,5,0)=0,\"\",VLOOKUP(K7,일정!$B$6:$L$371,5,0)))","v":""},null,{"$f":"IF(MONTH(M7)<>$B$2,\"\",IF(VLOOKUP(M7,일정!$B$6:$L$371,5,0)=0,\"\",VLOOKUP(M7,일정!$B$6:$L$371,5,0)))","v":""},null,{"$f":"IF(MONTH(O7)<>$B$2,\"\",IF(VLOOKUP(O7,일정!$B$6:$L$371,5,0)=0,\"\",VLOOKUP(O7,일정!$B$6:$L$371,5,0)))","v":""}]
[null,{"$f":"IF(MONTH(C7)<>$B$2,\"\",IF(VLOOKUP(C7,일정!$B$6:$L$371,6,0)=0,\"\",VLOOKUP(C7,일정!$B$6:$L$371,6,0)))","v":""},null,{"$f":"IF(MONTH(E7)<>$B$2,\"\",IF(VLOOKUP(E7,일정!$B$6:$L$371,6,0)=0,\"\",VLOOKUP(E7,일정!$B$6:$L$371,6,0)))","v":""},null,{"$f":"IF(MONTH(G7)<>$B$2,\"\",IF(VLOOKUP(G7,일정!$B$6:$L$371,6,0)=0,\"\",VLOOKUP(G7,일정!$B$6:$L$371,6,0)))","v":""},null,{"$f":"IF(MONTH(I7)<>$B$2,\"\",IF(VLOOKUP(I7,일정!$B$6:$L$371,6,0)=0,\"\",VLOOKUP(I7,일정!$B$6:$L$371,6,0)))","v":""},null,{"$f":"IF(MONTH(K7)<>$B$2,\"\",IF(VLOOKUP(K7,일정!$B$6:$L$371,6,0)=0,\"\",VLOOKUP(K7,일정!$B$6:$L$371,6,0)))","v":""},null,{"$f":"IF(MONTH(M7)<>$B$2,\"\",IF(VLOOKUP(M7,일정!$B$6:$L$371,6,0)=0,\"\",VLOOKUP(M7,일정!$B$6:$L$371,6,0)))","v":""},null,{"$f":"IF(MONTH(O7)<>$B$2,\"\",IF(VLOOKUP(O7,일정!$B$6:$L$371,6,0)=0,\"\",VLOOKUP(O7,일정!$B$6:$L$371,6,0)))","v":""},null,null,null,null,null,null,null,null,null,{"$f":"IF(MONTH(C7)<>$B$2,\"\",IF(VLOOKUP(C7,일정!$B$6:$L$371,7,0)=0,\"\",VLOOKUP(C7,일정!$B$6:$L$371,7,0)))","v":""},null,{"$f":"IF(MONTH(E7)<>$B$2,\"\",IF(VLOOKUP(E7,일정!$B$6:$L$371,7,0)=0,\"\",VLOOKUP(E7,일정!$B$6:$L$371,7,0)))","v":""},null,{"$f":"IF(MONTH(G7)<>$B$2,\"\",IF(VLOOKUP(G7,일정!$B$6:$L$371,7,0)=0,\"\",VLOOKUP(G7,일정!$B$6:$L$371,7,0)))","v":""},null,{"$f":"IF(MONTH(I7)<>$B$2,\"\",IF(VLOOKUP(I7,일정!$B$6:$L$371,7,0)=0,\"\",VLOOKUP(I7,일정!$B$6:$L$371,7,0)))","v":""},null,{"$f":"IF(MONTH(K7)<>$B$2,\"\",IF(VLOOKUP(K7,일정!$B$6:$L$371,7,0)=0,\"\",VLOOKUP(K7,일정!$B$6:$L$371,7,0)))","v":""},null,{"$f":"IF(MONTH(M7)<>$B$2,\"\",IF(VLOOKUP(M7,일정!$B$6:$L$371,7,0)=0,\"\",VLOOKUP(M7,일정!$B$6:$L$371,7,0)))","v":""},null,{"$f":"IF(MONTH(O7)<>$B$2,\"\",IF(VLOOKUP(O7,일정!$B$6:$L$371,7,0)=0,\"\",VLOOKUP(O7,일정!$B$6:$L$371,7,0)))","v":""}]
{"$rows_left_out":4939}
{"sheet":"일정","index":3,"n_rows":371,"n_cols":14,"rows_kept":371,"cut":false,"hidden":false,"merged":[[3,0,3,12],[4,0,4,12]]}
[]
[null,null,null,null,null,null,null,null,null,null,null,null,"범례","중요"]
[null,null,null,null,null,null,null,null,null,null,null,null,null,"업무"]
["질문 1: 예제 파일 시트에 \"개별운동\" 단어가 있으면 일정 시트에 동일 날짜 C열에는 \"○ 개별운동\" D 열에는 \"중요\"를 자동으로 넣는 함수 있을 까요??",null,null,null,null,null,null,null,null,null,null,null,null,"개인"]
["질문 2 : M열에 개별운동 횟수를 자동으로 나타나게 할 수 있는 함수는요?",null,null,null,null,null,null,null,null,null,null,null,null,"기타"]
[null,"날짜","일정1 내용","일정1 범례","일정2 내용","일정2 범례","일정3 내용","일정3 범례","일정4 내용","일정4 범례","일정5 내용","일정5 범례","개별운동 횟수?"]
[null,{"$f":"DATE(연간!$O$2,연간!$E$4,1)","v":"2022-01-01"}]
[null,{"$f":"B7+1","v":"2022-01-02"}]
[null,{"$f":"B8+1","v":"2022-01-03"}]
[null,"2022-01-04"]
{"$rows_left_out":362}
{"sheet":"공휴일","index":4,"n_rows":29,"n_cols":6,"rows_kept":29,"cut":false,"hidden":false,"merged":[[0,4,0,5],[0,2,0,3]]}
["월","일","공휴일",null,"기념일"]
[{"$f":"IF(C2=\"\",\"\",MONTH(C2))","v":1},{"$f":"IF(C2=\"\",\"\",DAY(C2))","v":1},{"$f":"DATE(연간!$O$2,1,1)","v":"2022-01-01"},"신정",{"$f":"DATE(연간!$O$2,11,8)","v":"2022-11-08"},"기념일 예시"]
[{"$f":"IF(C3=\"\",\"\",MONTH(C3))","v":1},{"$f":"IF(C3=\"\",\"\",DAY(C3))","v":31},{"$f":"INDEX(날짜,MATCH(연간!$O$2,공휴일연도,0),0)","v":"2022-01-31"},"설날"]
[2,1,{"$f":"C3+1","v":"2022-02-01"},"설날"]
[2,2,{"$f":"C4+1","v":"2022-02-02"},"설날"]
[3,1,{"$f":"DATE(연간!$O$2,3,1)","v":"2022-03-01"},"삼일절"]
[5,5,{"$f":"DATE(연간!$O$2,5,5)","v":"2022-05-05"},"어린이날"]
[5,8,{"$f":"INDEX(날짜,MATCH(1,($D$8=휴일명)*(연간!$O$2=공휴일연도),0))","v":"2022-05-08"},"석가탄신일"]
[6,6,{"$f":"DATE(연간!$O$2,6,6)","v":"2022-06-06"},"현충일"]
[8,15,{"$f":"DATE(연간!$O$2,8,15)","v":"2022-08-15"},"광복절"]
{"$rows_left_out":20}
{"sheet":"디데이","index":5,"n_rows":12,"n_cols":6,"rows_kept":12,"cut":false,"hidden":false,"merged":[]}
[]
[null,"디데이 내용 입력",null,null,{"$f":"IF(C2=\"\",\"\",\"📆 \"&C2)","v":""},{"$f":"IF(C4=\"\",\"\",C5)","v":""}]
[null,"오늘 날짜",{"$f":"TODAY()","v":"2022-10-03"}]
[null,"기준일 입력"]
[null,"D-day",{"$f":"IF(C4-C3<0,\"D+\"&ABS(C4-C3),\"D-\"&C4-C3)","v":"D+44837"}]
[]
[null,"디데이 내용 입력",null,null,{"$f":"IF(C7=\"\",\"\",\"📆 \"&C7)","v":""},{"$f":"IF(C9=\"\",\"\",C10)","v":""}]
[null,"오늘 날짜",{"$f":"TODAY()","v":"2022-10-03"}]
[null,"기준일 입력"]
[null,"D-day",{"$f":"IF(C9-C8<0,\"D+\"&ABS(C9-C8),\"D-\"&C9-C8)","v":"D+44837"}]
{"$rows_left_out":3}
{"sheet":"예제 파일","index":6,"n_rows":224,"n_cols":3,"rows_kept":224,"cut":false,"hidden":false,"merged":[]}
["구분","일자","내용"]
["개인관찰기록지","2022-01-17","○ 개별운동\n   0 장소 : 4호실\n   0 내용 : 스트레칭 밴드 운동, 소도구 활용 운동\n   \n   - 스트레칭 밴드가 끊어져 사용할 수 없어 노란색 밴드를\n     인터넷으로 주문했다고 함\n\n   - 작년과 운동방법은 동일하지만 횟수를 10회에서 15회로 늘려\n     3세트 운동할 수 있도록 지원하겠다고 안내함\n\n   - 소도구 활용 운동방법으로 손에 악력이 약해 아력운동을\n     할 수 있도록 스펀지 공으로 주먹쥐기 운동을 상의하여 \n     스펀지 공 악력운동할 수 있도록 마술용 스펀지 공을 구입함"]
["개인관찰기록지","2022-01-20","○ 개별운동\n   0 장소 : 4호실\n   0 내용 : 스트레칭 밴드 운동\n   \n   - 운동 설명\n     1단계 몸풀기로 양팔을 위, 아래로 들었다가 내리며 15회씩\n     3세트함\n\n     2단계 침대 발 받침에 묶은 스트레칭 밴드를 15회씩 3세트 당기는\n     운동을 진행함\n\n     3단계 왼쪽 다리 올렸다 내리기 15회씩 3세트 운동 진행함\n\n    - 오랜만에 운동해서 너무 힘들다고 함\n \n    - 특히 왼쪽 다리 힘이 약해져 다리 올릴 때 너무 무겁게\n      느껴진다고 함"]
["개인관찰기록지","2022-01-24","○ 개별운동\n   0 장소 : 4호실\n   0 내용 : 스트레칭 밴드 운동, 소도구 활용 운동\n   \n   - 운동 설명\n     1단계 몸풀기로 양팔을 위, 아래로 들었다가 내리며 15회씩\n     3세트함\n\n     2단계 침대 발 받침에 묶은 스트레칭 밴드를 15회씩 3세트 당기는\n     운동을 진행함\n\n     3단계 왼쪽 다리 올렸다 내리기 15회씩 3세트 운동 진행함\n\n   - 3세트 12회 당겼을 때 힘이 빠져 너무 힘들다며 포기를 선언함\n\n   - 스펀지 공으로 악력운동을 지원한 결과 왼손은 마우스 등을 사용해서\n     8회할 수 있으며, 오른손은 3회 약력운동을 함"]
["개인관찰기록지","2022-01-27","○ 개별운동\n   0 장소 : 4호실\n   0 내용 : 스트레칭 밴드 운동\n   \n   - 운동 설명\n     1단계 몸풀기로 양팔을 위, 아래로 들었다가 내리며 15회씩\n     3세트함\n\n     2단계 침대 발 받침에 묶은 스트레칭 밴드를 15회씩 3세트 당기는\n     운동을 진행함\n\n     3단계 왼쪽 다리 올렸다 내리기 15회씩 3세트 운동 진행함\n\n    - TV에 나오는 보치아 경기를 보면서 팔에 힘을 길러\n      보치아 대회 우승해 보고 싶다고 얘기함"]
["개인관찰기록지","2022-01-31","○ 개별운동\n   0 장소 : 4호실\n   0 내용 : 스트레칭 밴드 운동\n   \n   - 운동 설명\n     1단계 몸풀기로 양팔을 위, 아래로 들었다가 내리며 15회씩\n     3세트함\n\n     2단계 침대 발 받침에 묶은 스트레칭 밴드를 15회씩 3세트 당기는\n     운동을 진행함\n\n     3단계 왼쪽 다리 올렸다 내리기 15회씩 3세트 운동 진행함\n\n   - 전보다 힘들지는 않지만 그래도 3세트 13회에서 포기하고\n     싶은 고비가 온다고 함"]
["개인관찰기록지","2022-02-04","○ 개별운동\n   0 장소 : 4호실\n   0 내용 : 스트레칭 밴드 운동, 소도구 활용 운동\n   \n   - 운동 설명\n     1단계 몸풀기로 양팔을 위, 아래로 들었다가 내리며 15회씩\n     3세트함\n\n     2단계 침대 발 받침에 묶은 스트레칭 밴드를 15회씩 3세트 당기는\n     운동을 진행함\n\n     3단계 왼쪽 다리 올렸다 내리기 15회씩 3세트 운동 진행함\n\n   - 3세트 13회를 계속 넘기지 못해 아쉽기도 하고 욕심이 생긴다고 함\n\n   - 스펀지볼을 활용한 악력 운동 결과 왼손으로는 8회, 오른손 3회함"]
["개인관찰기록지","2022-02-07","○ 개별운동\n   0 장소 : 4호실\n   0 내용 : 스트레칭 밴드 운동\n   \n   - 운동 설명\n     1단계 몸풀기로 양팔을 위, 아래로 들었다가 내리며 15회씩\n     3세트함\n\n     2단계 침대 발 받침에 묶은 스트레칭 밴드를 15회씩 3세트 당기는\n     운동을 진행함\n\n     3단계 왼쪽 다리 올렸다 내리기 15회씩 3세트 운동 진행함\n\n   - 3세트 13회를 넘겨 14회까지 완료함\n\n   - 목표까지 1회 남았다며 좋아함"]
["개인관찰기록지","2022-02-10","○ 개별운동\n   0 장소 : 4호실\n   0 내용 : 스트레칭 밴드 운동, 소도구 활용 운동\n   \n   - 운동 설명\n     1단계 몸풀기로 양팔을 위, 아래로 들었다가 내리며 15회씩\n     3세트함\n\n     2단계 침대 발 받침에 묶은 스트레칭 밴드를 15회씩 3세트 당기는\n     운동을 진행함\n\n     3단계 왼쪽 다리 올렸다 내리기 15회씩 3세트 운동 진행함\n\n   - 컨디션이 좋지 않다고 하여 2세트 10회하고 종료함\n\n   - 스펀지볼을 활용한 악력 운동 결과 왼손으로는 8회, 오른손 3회함"]
["개인관찰기록지","2022-02-15","○ 개별운동\n   0 장소 : 4호실\n   0 내용 : 스트레칭 밴드 운동\n   \n   - 운동 설명\n     1단계 몸풀기로 양팔을 위, 아래로 들었다가 내리며 15회씩\n     3세트함\n\n     2단계 침대 발 받침에 묶은 스트레칭 밴드를 15회씩 3세트 당기는\n     운동을 진행함\n\n     3단계 왼쪽 다리 올렸다 내리기 15회씩 3세트 운동 진행함\n\n   - 전보다 팔에 힘이 생긴 것 같다며 좋아함"]
{"$rows_left_out":215}
{"sheet":"이름지정","index":7,"n_rows":637,"n_cols":5,"rows_kept":637,"cut":false,"hidden":true,"merged":[]}
["년도","월","연도","날짜","휴일명"]
[2010,1,{"$f":"YEAR(D2)","v":2010},"2010-02-13","설날"]
[2011,2,{"$f":"YEAR(D3)","v":2010},"2010-02-14","설날"]
[2012,3,2010,"2010-02-15","설날"]
[2013,4,2010,"2010-05-21","석가탄신일"]
[2014,5,2010,"2010-09-21","추석"]
[2015,6,2010,"2010-09-22","추석"]
[2016,7,2010,"2010-09-23","추석"]
[2017,8,2011,"2011-02-02","설날"]
[2018,9,2011,"2011-02-03","설날"]
{"$rows_left_out":627}