{"text_format":"1","workbook":"xlsx","n_sheets":6,"sheets":["공휴일","연간","1월","11월","11월 (2)","이름지정"],"not_rendered":{"charts":0,"images":0,"macros":1,"external_links":0,"defined_names":11,"comments":5,"pivot_tables":0},"unopened":[],"bounds":{"document_bytes":16777216,"sheet_cells":100000,"rows_first":2000,"rows_last":500,"rows_between":2000,"halvings":0,"cell_chars":16384,"cell_head_chars":4096},"cells_cut":0,"cells_raw":0,"read":"whole","date_system":"1900"}

{"sheet":"공휴일","index":0,"n_rows":18,"n_cols":4,"rows_kept":18,"cut":false,"hidden":false,"merged":[[0,2,0,3],[0,0,0,1]]}
["공휴일",null,"기념일"]
[{"$f":"DATE(연간!$O$2,1,1)","v":"2022-01-01"},"신정",{"$f":"DATE(연간!$O$2,7,11)","v":"2022-07-11"},"칠석회향"]
[{"$f":"INDEX(날짜,MATCH(연간!$O$2,공휴일연도,0),0)","v":"2022-01-31"},"설날",{"$f":"DATE(연간!$O$2,7,12)","v":"2022-07-12"},"수능100일기도입재"]
[{"$f":"A3+1","v":"2022-02-01"},"설날"]
[{"$f":"A4+1","v":"2022-02-02"},"설날"]
[{"$f":"DATE(연간!$O$2,3,1)","v":"2022-03-01"},"삼일절"]
[{"$f":"DATE(연간!$O$2,5,5)","v":"2022-05-05"},"어린이날"]
[{"$f":"INDEX(날짜,MATCH(1,($B$8=휴일명)*(연간!$O$2=공휴일연도),0))","v":"2022-05-08"},"석가탄신일"]
[{"$f":"DATE(연간!$O$2,6,6)","v":"2022-06-06"},"현충일"]
[{"$f":"DATE(연간!$O$2,8,15)","v":"2022-08-15"},"광복절"]
[{"$f":"INDEX(날짜,MATCH(1,($B$11=휴일명)*(연간!$O$2=공휴일연도),0))","v":"2022-09-09"},"추석"]
[{"$f":"A11+1","v":"2022-09-10"},"추석"]
[{"$f":"A12+1","v":"2022-09-11"},"추석"]
[{"$f":"DATE(연간!$O$2,10,3)","v":"2022-10-03"},"개천절"]
[{"$f":"DATE(연간!$O$2,10,9)","v":"2022-10-09"},"한글날"]
{"$rows_left_out":4}
{"sheet":"연간","index":1,"n_rows":32,"n_cols":32,"rows_kept":32,"cut":false,"hidden":false,"merged":[[1,14,1,18]]}
[]
[null,"S",null,null,null,null,null,null,null,null,null,null,null,null,2022]
[]
[null,null,null,null,1,null,null,null,null,null,null,null,2,null,null,null,null,null,null,null,3,null,null,null,null,null,null,null,4]
[]
[null,{"$f":"IF($B$2=\"S\",\"S\",IF($B$2=\"M\",\"M\"))","v":"S"},{"$f":"IF($B$2=\"S\",\"M\",IF($B$2=\"M\",\"T\"))","v":"M"},{"$f":"IF($B$2=\"S\",\"T\",IF($B$2=\"M\",\"W\"))","v":"T"},{"$f":"IF($B$2=\"S\",\"W\",IF($B$2=\"M\",\"T\"))","v":"W"},{"$f":"IF($B$2=\"S\",\"T\",IF($B$2=\"M\",\"F\"))","v":"T"},{"$f":"IF($B$2=\"S\",\"F\",IF($B$2=\"M\",\"S\"))","v":"F"},"S",null,{"$f":"IF($B$2=\"S\",\"S\",IF($B$2=\"M\",\"M\"))","v":"S"},{"$f":"IF($B$2=\"S\",\"M\",IF($B$2=\"M\",\"T\"))","v":"M"},{"$f":"IF($B$2=\"S\",\"T\",IF($B$2=\"M\",\"W\"))","v":"T"},{"$f":"IF($B$2=\"S\",\"W\",IF($B$2=\"M\",\"T\"))","v":"W"},{"$f":"IF($B$2=\"S\",\"T\",IF($B$2=\"M\",\"F\"))","v":"T"},{"$f":"IF($B$2=\"S\",\"F\",IF($B$2=\"M\",\"S\"))","v":"F"},"S",null,{"$f":"IF($B$2=\"S\",\"S\",IF($B$2=\"M\",\"M\"))","v":"S"},{"$f":"IF($B$2=\"S\",\"M\",IF($B$2=\"M\",\"T\"))","v":"M"},{"$f":"IF($B$2=\"S\",\"T\",IF($B$2=\"M\",\"W\"))","v":"T"},{"$f":"IF($B$2=\"S\",\"W\",IF($B$2=\"M\",\"T\"))","v":"W"},{"$f":"IF($B$2=\"S\",\"T\",IF($B$2=\"M\",\"F\"))","v":"T"},{"$f":"IF($B$2=\"S\",\"F\",IF($B$2=\"M\",\"S\"))","v":"F"},"S",null,{"$f":"IF($B$2=\"S\",\"S\",IF($B$2=\"M\",\"M\"))","v":"S"},{"$f":"IF($B$2=\"S\",\"M\",IF($B$2=\"M\",\"T\"))","v":"M"},{"$f":"IF($B$2=\"S\",\"T\",IF($B$2=\"M\",\"W\"))","v":"T"},{"$f":"IF($B$2=\"S\",\"W\",IF($B$2=\"M\",\"T\"))","v":"W"},{"$f":"IF($B$2=\"S\",\"T\",IF($B$2=\"M\",\"F\"))","v":"T"},{"$f":"IF($B$2=\"S\",\"F\",IF($B$2=\"M\",\"S\"))","v":"F"},"S"]
[null,{"$f":"IF(B2=\"M\",(IF(DAY(DATE($O$2,$E$4,1)-WEEKDAY(DATE($O$2,$E$4,1))+2)=2,DATE($O$2,$E$4,1)-WEEKDAY(DATE($O$2,$E$4,1))-5,DATE($O$2,$E$4,1)-WEEKDAY(DATE($O$2,$E$4,1))+2)),IF(B2=\"S\",DATE($O$2,$E$4,1)-WEEKDAY(DATE($O$2,$E$4,1))+1))","v":"2021-12-26"},{"$f":"B7+1","v":"2021-12-27"},{"$f":"C7+1","v":"2021-12-28"},"2021-12-29","2021-12-30","2021-12-31","2022-01-01",null,{"$f":"IF(B2=\"M\",(IF(DAY(DATE($O$2,$M$4,1)-WEEKDAY(DATE($O$2,$M$4,1))+2)=2,DATE($O$2,$M$4,1)-WEEKDAY(DATE($O$2,$M$4,1))-5,DATE($O$2,$M$4,1)-WEEKDAY(DATE($O$2,$M$4,1))+2)),IF(B2=\"S\",DATE($O$2,$M$4,1)-WEEKDAY(DATE($O$2,$M$4,1))+1))","v":"2022-01-30"},{"$f":"J7+1","v":"2022-01-31"},{"$f":"K7+1","v":"2022-02-01"},"2022-02-02","2022-02-03","2022-02-04","2022-02-05",null,{"$f":"IF(B2=\"M\",(IF(DAY(DATE($O$2,$U$4,1)-WEEKDAY(DATE($O$2,$U$4,1))+2)=2,DATE($O$2,$U$4,1)-WEEKDAY(DATE($O$2,$U$4,1))-5,DATE($O$2,$U$4,1)-WEEKDAY(DATE($O$2,$U$4,1))+2)),IF(B2=\"S\",DATE($O$2,$U$4,1)-WEEKDAY(DATE($O$2,$U$4,1))+1))","v":"2022-02-27"},{"$f":"R7+1","v":"2022-02-28"},{"$f":"S7+1","v":"2022-03-01"},"2022-03-02","2022-03-03","2022-03-04","2022-03-05",null,{"$f":"IF(B2=\"M\",(IF(DAY(DATE($O$2,$AC$4,1)-WEEKDAY(DATE($O$2,$AC$4,1))+2)=2,DATE($O$2,$AC$4,1)-WEEKDAY(DATE($O$2,$AC$4,1))-5,DATE($O$2,$AC$4,1)-WEEKDAY(DATE($O$2,$AC$4,1))+2)),IF(B2=\"S\",DATE($O$2,$AC$4,1)-WEEKDAY(DATE($O$2,$AC$4,1))+1))","v":"2022-03-27"},{"$f":"Z7+1","v":"2022-03-28"},{"$f":"AA7+1","v":"2022-03-29"},"2022-03-30","2022-03-31","2022-04-01","2022-04-02"]
[null,{"$f":"B7+7","v":"2022-01-02"},{"$f":"C7+7","v":"2022-01-03"},"2022-01-04","2022-01-05","2022-01-06","2022-01-07","2022-01-08",null,{"$f":"J7+7","v":"2022-02-06"},{"$f":"K7+7","v":"2022-02-07"},{"$f":"L7+7","v":"2022-02-08"},{"$f":"M7+7","v":"2022-02-09"},{"$f":"N7+7","v":"2022-02-10"},{"$f":"O7+7","v":"2022-02-11"},{"$f":"P7+7","v":"2022-02-12"},null,{"$f":"R7+7","v":"2022-03-06"},{"$f":"S7+7","v":"2022-03-07"},{"$f":"T7+7","v":"2022-03-08"},{"$f":"U7+7","v":"2022-03-09"},{"$f":"V7+7","v":"2022-03-10"},{"$f":"W7+7","v":"2022-03-11"},{"$f":"X7+7","v":"2022-03-12"},null,{"$f":"Z7+7","v":"2022-04-03"},{"$f":"AA7+7","v":"2022-04-04"},{"$f":"AB7+7","v":"2022-04-05"},{"$f":"AC7+7","v":"2022-04-06"},{"$f":"AD7+7","v":"2022-04-07"},{"$f":"AE7+7","v":"2022-04-08"},{"$f":"AF7+7","v":"2022-04-09"}]
[null,{"$f":"B8+7","v":"2022-01-09"},"2022-01-10","2022-01-11","2022-01-12","2022-01-13","2022-01-14","2022-01-15",null,{"$f":"J8+7","v":"2022-02-13"},"2022-02-14","2022-02-15","2022-02-16","2022-02-17","2022-02-18","2022-02-19",null,{"$f":"R8+7","v":"2022-03-13"},"2022-03-14","2022-03-15","2022-03-16","2022-03-17","2022-03-18","2022-03-19",null,{"$f":"Z8+7","v":"2022-04-10"},"2022-04-11","2022-04-12","2022-04-13","2022-04-14","2022-04-15","2022-04-16"]
[null,{"$f":"B9+7","v":"2022-01-16"},"2022-01-17","2022-01-18","2022-01-19","2022-01-20","2022-01-21","2022-01-22",null,{"$f":"J9+7","v":"2022-02-20"},"2022-02-21","2022-02-22","2022-02-23","2022-02-24","2022-02-25","2022-02-26",null,{"$f":"R9+7","v":"2022-03-20"},"2022-03-21","2022-03-22","2022-03-23","2022-03-24","2022-03-25","2022-03-26",null,{"$f":"Z9+7","v":"2022-04-17"},"2022-04-18","2022-04-19","2022-04-20","2022-04-21","2022-04-22","2022-04-23"]
[null,{"$f":"B10+7","v":"2022-01-23"},"2022-01-24","2022-01-25","2022-01-26","2022-01-27","2022-01-28","2022-01-29",null,{"$f":"J10+7","v":"2022-02-27"},"2022-02-28","2022-03-01","2022-03-02","2022-03-03","2022-03-04","2022-03-05",null,{"$f":"R10+7","v":"2022-03-27"},"2022-03-28","2022-03-29","2022-03-30","2022-03-31","2022-04-01","2022-04-02",null,{"$f":"Z10+7","v":"2022-04-24"},"2022-04-25","2022-04-26","2022-04-27","2022-04-28","2022-04-29","2022-04-30"]
[null,{"$f":"B11+7","v":"2022-01-30"},"2022-01-31","2022-02-01","2022-02-02","2022-02-03","2022-02-04","2022-02-05",null,{"$f":"J11+7","v":"2022-03-06"},"2022-03-07","2022-03-08","2022-03-09","2022-03-10","2022-03-11","2022-03-12",null,{"$f":"R11+7","v":"2022-04-03"},"2022-04-04","2022-04-05","2022-04-06","2022-04-07","2022-04-08","2022-04-09",null,{"$f":"Z11+7","v":"2022-05-01"},"2022-05-02","2022-05-03","2022-05-04","2022-05-05","2022-05-06","2022-05-07"]
[]
[null,null,null,null,5,null,null,null,null,null,null,null,6,null,null,null,null,null,null,null,7,null,null,null,null,null,null,null,8]
[]
{"$rows_left_out":18}
{"sheet":"1월","index":2,"n_rows":4946,"n_cols":19,"rows_kept":4946,"cut":false,"hidden":false,"merged":[[37,7,37,8],[37,5,37,6],[1,5,3,14],[0,5,0,14],[2,3,3,3],[7,1,7,2],[7,3,7,4],[7,5,7,6],[7,7,7,8],[7,9,7,10],[7,11,7,12],[7,13,7,14],[5,1,5,2],[5,3,5,4],[1,1,3,2],[5,11,5,12],[5,9,5,10],[5,13,5,14],[5,5,5,6],[5,7,5,8],[8,13,8,14],[9,1,9,2],[9,3,9,4],[9,5,9,6],[9,7,9,8],[9,9,9,10],[9,11,9,12],[9,13,9,14],[8,1,8,2],[8,3,8,4],[8,5,8,6],[8,7,8,8],[8,9,8,10],[8,11,8,12],[10,13,10,14],[11,1,11,2],[11,3,11,4],[11,5,11,6],[11,7,11,8],[11,9,11,10],[11,11,11,12],[11,13,11,14],[10,1,10,2],[10,3,10,4],[10,5,10,6],[10,7,10,8],[10,9,10,10],[10,11,10,12],[13,13,13,14],[14,1,14,2],[14,3,14,4],[14,5,14,6],[14,7,14,8],[14,9,14,10],[14,11,14,12],[14,13,14,14],[13,1,13,2],[13,3,13,4],[13,5,13,6],[13,7,13,8],[13,9,13,10],[13,11,13,12],[15,13,15,14],[16,1,16,2],[16,3,16,4],[16,5,16,6],[16,7,16,8],[16,9,16,10],[16,11,16,12],[16,13,16,14],[15,1,15,2],[15,3,15,4],[15,5,15,6],[15,7,15,8],[15,9,15,10],[15,11,15,12],[17,13,17,14],[19,1,19,2],[19,3,19,4],[19,5,19,6],[19,7,19,8],[19,9,19,10],[19,11,19,12],[19,13,19,14],[17,1,17,2],[17,3,17,4],[17,5,17,6],[17,7,17,8],[17,9,17,10],[17,11,17,12],[20,13,20,14],[21,1,21,2],[21,3,21,4],[21,5,21,6],[21,7,21,8],[21,9,21,10],[21,11,21,12],[21,13,21,14],[20,1,20,2],[20,3,20,4],[20,5,20,6],[20,7,20,8],[20,9,20,10],[20,11,20,12],[22,13,22,14],[23,1,23,2],[23,3,23,4],[23,5,23,6],[23,7,23,8],[23,9,23,10],[23,11,23,12],[23,13,23,14],[22,1,22,2],[22,3,22,4],[22,5,22,6],[22,7,22,8],[22,9,22,10],[22,11,22,12],[25,13,25,14],[26,1,26,2],[26,3,26,4],[26,5,26,6],[26,7,26,8],[26,9,26,10],[26,11,26,12],[26,13,26,14],[25,1,25,2],[25,3,25,4],[25,5,25,6],[25,7,25,8],[25,9,25,10],[25,11,25,12],[29,13,29,14],[29,1,29,2],[29,3,29,4],[29,5,29,6],[29,7,29,8],[29,9,29,10],[29,11,29,12],[27,13,27,14],[28,1,28,2],[28,3,28,4],[28,5,28,6],[28,7,28,8],[28,9,28,10],[28,11,28,12],[28,13,28,14],[27,1,27,2],[27,3,27,4],[27,5,27,6],[27,7,27,8],[27,9,27,10],[27,11,27,12],[50,11,50,14],[32,13,32,14],[33,1,33,2],[33,3,33,4],[33,5,33,6],[33,7,33,8],[33,9,33,10],[33,11,33,12],[33,13,33,14],[32,1,32,2],[32,3,32,4],[32,5,32,6],[32,7,32,8],[32,9,32,10],[32,11,32,12],[37,13,37,14],[37,11,37,12],[37,3,37,4],[37,1,37,2],[37,9,37,10],[35,1,35,2],[35,3,35,4],[35,5,35,6],[35,7,35,8],[35,9,35,10],[35,11,35,12],[35,13,35,14],[31,1,31,2],[31,3,31,4],[31,5,31,6],[31,7,31,8],[31,9,31,10],[31,11,31,12],[31,13,31,14],[34,1,34,2],[34,3,34,4],[34,5,34,6],[34,7,34,8],[34,9,34,10],[34,11,34,12],[34,13,34,14]]}
[]
[null,9,null,2022,null,"불기 2566년   단기 4355년  서기 2022년"]
[null,null,null,{"$f":"TEXT(DATE(D2,B2,1),\"mmmm\")","v":"September"},null,null,null,null,null,null,null,null,null,null,null,null,null,null,"←클릭 전 주의해주세요!"]
[]
[null,null,null,null,null,"]"]
[null,{"$f":"IF(연간!$B$2=\"S\",\"SUN\",IF(연간!$B$2=\"M\",\"MON\"))","v":"SUN"},null,{"$f":"IF(연간!$B$2=\"S\",\"MON\",IF(연간!$B$2=\"M\",\"TUE\"))","v":"MON"},null,{"$f":"IF(연간!$B$2=\"S\",\"TUE\",IF(연간!$B$2=\"M\",\"WED\"))","v":"TUE"},null,{"$f":"IF(연간!$B$2=\"S\",\"WED\",IF(연간!$B$2=\"M\",\"THU\"))","v":"WED"},null,{"$f":"IF(연간!$B$2=\"S\",\"THU\",IF(연간!$B$2=\"M\",\"FRI\"))","v":"THU"},null,{"$f":"IF(연간!$B$2=\"S\",\"FRI\",IF(연간!$B$2=\"M\",\"SAT\"))","v":"FRI"},null,{"$f":"IF(연간!$B$2=\"S\",\"SAT\",IF(연간!$B$2=\"M\",\"SUN\"))","v":"SAT"}]
[null,null,{"$f":"IF(연간!$B$2=\"M\",(IF(DAY(DATE($D$2,$B$2,1)-WEEKDAY(DATE($D$2,$B$2,1))+2)=2,DATE($D$2,$B$2,1)-WEEKDAY(DATE($D$2,$B$2,1))-5,DATE($D$2,$B$2,1)-WEEKDAY(DATE($D$2,$B$2,1))+2)),IF(연간!$B$2=\"S\",DATE($D$2,$B$2,1)-WEEKDAY(DATE($D$2,$B$2,1))+1))","v":"2022-08-28"},null,{"$f":"C7+1","v":"2022-08-29"},null,{"$f":"C7+2","v":"2022-08-30"},null,{"$f":"C7+3","v":"2022-08-31"},null,{"$f":"C7+4","v":"2022-09-01"},null,{"$f":"C7+5","v":"2022-09-02"},null,{"$f":"C7+6","v":"2022-09-03"},null,"개인일정"]
[null,{"$f":"TEXT(C7,\"[$-000E0000]m/d\")","v":"8/2"},null,{"$f":"TEXT(E7,\"[$-000E0000]m/d\")","v":"8/3"},null,{"$f":"TEXT(G7,\"[$-000E0000]m/d\")","v":"8/4"},null,{"$f":"TEXT(I7,\"[$-000E0000]m/d\")","v":"8/5"},null,{"$f":"TEXT(K7,\"[$-000E0000]m/d\")","v":"8/6"},null,{"$f":"TEXT(M7,\"[$-000E0000]m/d\")","v":"8/7"},null,{"$f":"TEXT(O7,\"[$-000E0000]m/d\")","v":"8/8"},null,null,"업무일정"]
[null,null,null,null,null,null,null,null,null,null,null,null,null,null,null,null,"중요일정"]
[null,null,null,null,null,null,null,null,null,null,null,null,null,null,null,null,"기념일"]
[]
[]
[null,null,{"$f":"C7+7","v":"2022-09-04"},null,{"$f":"C7+8","v":"2022-09-05"},null,{"$f":"C7+9","v":"2022-09-06"},null,{"$f":"C7+10","v":"2022-09-07"},null,{"$f":"C7+11","v":"2022-09-08"},null,{"$f":"C7+12","v":"2022-09-09"},null,{"$f":"C7+13","v":"2022-09-10"}]
[null,{"$f":"TEXT(C13,\"[$-000E0000]m/d\")","v":"8/9"},null,{"$f":"TEXT(E13,\"[$-000E0000]m/d\")","v":"8/10"},null,{"$f":"TEXT(G13,\"[$-000E0000]m/d\")","v":"8/11"},null,{"$f":"TEXT(I13,\"[$-000E0000]m/d\")","v":"8/12"},null,{"$f":"TEXT(K13,\"[$-000E0000]m/d\")","v":"8/13"},null,{"$f":"TEXT(M13,\"[$-000E0000]m/d\")","v":"8/14"},null,{"$f":"TEXT(O13,\"[$-000E0000]m/d\")","v":"8/15"}]
[]
{"$rows_left_out":4932}
{"sheet":"11월","index":3,"n_rows":4946,"n_cols":19,"rows_kept":4946,"cut":false,"hidden":false,"merged":[[5,13,5,14],[7,1,7,2],[7,3,7,4],[7,5,7,6],[7,7,7,8],[7,9,7,10],[7,11,7,12],[7,13,7,14],[0,5,0,14],[1,1,3,2],[1,5,3,14],[2,3,3,3],[5,1,5,2],[5,3,5,4],[5,5,5,6],[5,7,5,8],[5,9,5,10],[5,11,5,12],[8,13,8,14],[9,1,9,2],[9,3,9,4],[9,5,9,6],[9,7,9,8],[9,9,9,10],[9,11,9,12],[9,13,9,14],[8,1,8,2],[8,3,8,4],[8,5,8,6],[8,7,8,8],[8,9,8,10],[8,11,8,12],[10,13,10,14],[11,1,11,2],[11,3,11,4],[11,5,11,6],[11,7,11,8],[11,9,11,10],[11,11,11,12],[11,13,11,14],[10,1,10,2],[10,3,10,4],[10,5,10,6],[10,7,10,8],[10,9,10,10],[10,11,10,12],[13,13,13,14],[14,1,14,2],[14,3,14,4],[14,5,14,6],[14,7,14,8],[14,9,14,10],[14,11,14,12],[14,13,14,14],[13,1,13,2],[13,3,13,4],[13,5,13,6],[13,7,13,8],[13,9,13,10],[13,11,13,12],[15,13,15,14],[16,1,16,2],[16,3,16,4],[16,5,16,6],[16,7,16,8],[16,9,16,10],[16,11,16,12],[16,13,16,14],[15,1,15,2],[15,3,15,4],[15,5,15,6],[15,7,15,8],[15,9,15,10],[15,11,15,12],[17,13,17,14],[19,1,19,2],[19,3,19,4],[19,5,19,6],[19,7,19,8],[19,9,19,10],[19,11,19,12],[19,13,19,14],[17,1,17,2],[17,3,17,4],[17,5,17,6],[17,7,17,8],[17,9,17,10],[17,11,17,12],[20,13,20,14],[21,1,21,2],[21,3,21,4],[21,5,21,6],[21,7,21,8],[21,9,21,10],[21,11,21,12],[21,13,21,14],[20,1,20,2],[20,3,20,4],[20,5,20,6],[20,7,20,8],[20,9,20,10],[20,11,20,12],[22,13,22,14],[23,1,23,2],[23,3,23,4],[23,5,23,6],[23,7,23,8],[23,9,23,10],[23,11,23,12],[23,13,23,14],[22,1,22,2],[22,3,22,4],[22,5,22,6],[22,7,22,8],[22,9,22,10],[22,11,22,12],[25,13,25,14],[26,1,26,2],[26,3,26,4],[26,5,26,6],[26,7,26,8],[26,9,26,10],[26,11,26,12],[26,13,26,14],[25,1,25,2],[25,3,25,4],[25,5,25,6],[25,7,25,8],[25,9,25,10],[25,11,25,12],[27,13,27,14],[28,1,28,2],[28,3,28,4],[28,5,28,6],[28,7,28,8],[28,9,28,10],[28,11,28,12],[28,13,28,14],[27,1,27,2],[27,3,27,4],[27,5,27,6],[27,7,27,8],[27,9,27,10],[27,11,27,12],[29,13,29,14],[31,1,31,2],[31,3,31,4],[31,5,31,6],[31,7,31,8],[31,9,31,10],[31,11,31,12],[31,13,31,14],[29,1,29,2],[29,3,29,4],[29,5,29,6],[29,7,29,8],[29,9,29,10],[29,11,29,12],[32,13,32,14],[33,1,33,2],[33,3,33,4],[33,5,33,6],[33,7,33,8],[33,9,33,10],[33,11,33,12],[33,13,33,14],[32,1,32,2],[32,3,32,4],[32,5,32,6],[32,7,32,8],[32,9,32,10],[32,11,32,12],[37,13,37,14],[50,11,50,14],[37,1,37,2],[37,3,37,4],[37,5,37,6],[37,7,37,8],[37,9,37,10],[37,11,37,12],[34,13,34,14],[35,1,35,2],[35,3,35,4],[35,5,35,6],[35,7,35,8],[35,9,35,10],[35,11,35,12],[35,13,35,14],[34,1,34,2],[34,3,34,4],[34,5,34,6],[34,7,34,8],[34,9,34,10],[34,11,34,12]]}
[]
[null,11,null,2022,null,"불기 2566년   단기 4355년  서기 2022년"]
[null,null,null,{"$f":"TEXT(DATE(D2,B2,1),\"mmmm\")","v":"November"},null,null,null,null,null,null,null,null,null,null,null,null,null,null,"←클릭 전 주의해주세요!"]
[]
[]
[null,{"$f":"IF(연간!$B$2=\"S\",\"SUN\",IF(연간!$B$2=\"M\",\"MON\"))","v":"SUN"},null,{"$f":"IF(연간!$B$2=\"S\",\"MON\",IF(연간!$B$2=\"M\",\"TUE\"))","v":"MON"},null,{"$f":"IF(연간!$B$2=\"S\",\"TUE\",IF(연간!$B$2=\"M\",\"WED\"))","v":"TUE"},null,{"$f":"IF(연간!$B$2=\"S\",\"WED\",IF(연간!$B$2=\"M\",\"THU\"))","v":"WED"},null,{"$f":"IF(연간!$B$2=\"S\",\"THU\",IF(연간!$B$2=\"M\",\"FRI\"))","v":"THU"},null,{"$f":"IF(연간!$B$2=\"S\",\"FRI\",IF(연간!$B$2=\"M\",\"SAT\"))","v":"FRI"},null,{"$f":"IF(연간!$B$2=\"S\",\"SAT\",IF(연간!$B$2=\"M\",\"SUN\"))","v":"SAT"}]
[null,null,{"$f":"IF(연간!$B$2=\"M\",(IF(DAY(DATE($D$2,$B$2,1)-WEEKDAY(DATE($D$2,$B$2,1))+2)=2,DATE($D$2,$B$2,1)-WEEKDAY(DATE($D$2,$B$2,1))-5,DATE($D$2,$B$2,1)-WEEKDAY(DATE($D$2,$B$2,1))+2)),IF(연간!$B$2=\"S\",DATE($D$2,$B$2,1)-WEEKDAY(DATE($D$2,$B$2,1))+1))","v":"2022-10-30"},null,{"$f":"C7+1","v":"2022-10-31"},null,{"$f":"C7+2","v":"2022-11-01"},null,{"$f":"C7+3","v":"2022-11-02"},null,{"$f":"C7+4","v":"2022-11-03"},null,{"$f":"C7+5","v":"2022-11-04"},null,{"$f":"C7+6","v":"2022-11-05"},null,"개인일정"]
[null,{"$f":"TEXT(C7,\"[$-000E0000]m/d\")","v":"10/6"},null,{"$f":"TEXT(E7,\"[$-000E0000]m/d\")","v":"10/7"},null,{"$f":"TEXT(G7,\"[$-000E0000]m/d\")","v":"10/8"},null,{"$f":"TEXT(I7,\"[$-000E0000]m/d\")","v":"10/9"},null,{"$f":"TEXT(K7,\"[$-000E0000]m/d\")","v":"10/10"},null,{"$f":"TEXT(M7,\"[$-000E0000]m/d\")","v":"10/11"},null,{"$f":"TEXT(O7,\"[$-000E0000]m/d\")","v":"10/12"},null,null,"업무일정"]
[null,null,null,null,null,null,null,null,null,null,null,null,null,null,null,null,"중요일정"]
[null,null,null,null,null,null,null,null,null,null,null,null,null,null,null,null,"기념일"]
[]
[]
[null,null,{"$f":"C7+7","v":"2022-11-06"},null,{"$f":"C7+8","v":"2022-11-07"},null,{"$f":"C7+9","v":"2022-11-08"},null,{"$f":"C7+10","v":"2022-11-09"},null,{"$f":"C7+11","v":"2022-11-10"},null,{"$f":"C7+12","v":"2022-11-11"},null,{"$f":"C7+13","v":"2022-11-12"}]
[null,{"$f":"TEXT(C13,\"[$-000E0000]m/d\")","v":"10/13"},null,{"$f":"TEXT(E13,\"[$-000E0000]m/d\")","v":"10/14"},null,{"$f":"TEXT(G13,\"[$-000E0000]m/d\")","v":"10/15"},null,{"$f":"TEXT(I13,\"[$-000E0000]m/d\")","v":"10/16"},null,{"$f":"TEXT(K13,\"[$-000E0000]m/d\")","v":"10/17"},null,{"$f":"TEXT(M13,\"[$-000E0000]m/d\")","v":"10/18"},null,{"$f":"TEXT(O13,\"[$-000E0000]m/d\")","v":"10/19"}]
[]
{"$rows_left_out":4932}
{"sheet":"11월 (2)","index":4,"n_rows":4946,"n_cols":19,"rows_kept":4946,"cut":false,"hidden":false,"merged":[[5,13,5,14],[7,1,7,2],[7,3,7,4],[7,5,7,6],[7,7,7,8],[7,9,7,10],[7,11,7,12],[7,13,7,14],[0,5,0,14],[1,1,3,2],[1,5,3,14],[2,3,3,3],[5,1,5,2],[5,3,5,4],[5,5,5,6],[5,7,5,8],[5,9,5,10],[5,11,5,12],[8,13,8,14],[9,1,9,2],[9,3,9,4],[9,5,9,6],[9,7,9,8],[9,9,9,10],[9,11,9,12],[9,13,9,14],[8,1,8,2],[8,3,8,4],[8,5,8,6],[8,7,8,8],[8,9,8,10],[8,11,8,12],[10,13,10,14],[11,1,11,2],[11,3,11,4],[11,5,11,6],[11,7,11,8],[11,9,11,10],[11,11,11,12],[11,13,11,14],[10,1,10,2],[10,3,10,4],[10,5,10,6],[10,7,10,8],[10,9,10,10],[10,11,10,12],[13,13,13,14],[14,1,14,2],[14,3,14,4],[14,5,14,6],[14,7,14,8],[14,9,14,10],[14,11,14,12],[14,13,14,14],[13,1,13,2],[13,3,13,4],[13,5,13,6],[13,7,13,8],[13,9,13,10],[13,11,13,12],[15,13,15,14],[16,1,16,2],[16,3,16,4],[16,5,16,6],[16,7,16,8],[16,9,16,10],[16,11,16,12],[16,13,16,14],[15,1,15,2],[15,3,15,4],[15,5,15,6],[15,7,15,8],[15,9,15,10],[15,11,15,12],[17,13,17,14],[19,1,19,2],[19,3,19,4],[19,5,19,6],[19,7,19,8],[19,9,19,10],[19,11,19,12],[19,13,19,14],[17,1,17,2],[17,3,17,4],[17,5,17,6],[17,7,17,8],[17,9,17,10],[17,11,17,12],[20,13,20,14],[21,1,21,2],[21,3,21,4],[21,5,21,6],[21,7,21,8],[21,9,21,10],[21,11,21,12],[21,13,21,14],[20,1,20,2],[20,3,20,4],[20,5,20,6],[20,7,20,8],[20,9,20,10],[20,11,20,12],[22,13,22,14],[23,1,23,2],[23,3,23,4],[23,5,23,6],[23,7,23,8],[23,9,23,10],[23,11,23,12],[23,13,23,14],[22,1,22,2],[22,3,22,4],[22,5,22,6],[22,7,22,8],[22,9,22,10],[22,11,22,12],[25,13,25,14],[26,1,26,2],[26,3,26,4],[26,5,26,6],[26,7,26,8],[26,9,26,10],[26,11,26,12],[26,13,26,14],[25,1,25,2],[25,3,25,4],[25,5,25,6],[25,7,25,8],[25,9,25,10],[25,11,25,12],[27,13,27,14],[28,1,28,2],[28,3,28,4],[28,5,28,6],[28,7,28,8],[28,9,28,10],[28,11,28,12],[28,13,28,14],[27,1,27,2],[27,3,27,4],[27,5,27,6],[27,7,27,8],[27,9,27,10],[27,11,27,12],[29,13,29,14],[31,1,31,2],[31,3,31,4],[31,5,31,6],[31,7,31,8],[31,9,31,10],[31,11,31,12],[31,13,31,14],[29,1,29,2],[29,3,29,4],[29,5,29,6],[29,7,29,8],[29,9,29,10],[29,11,29,12],[32,13,32,14],[33,1,33,2],[33,3,33,4],[33,5,33,6],[33,7,33,8],[33,9,33,10],[33,11,33,12],[33,13,33,14],[32,1,32,2],[32,3,32,4],[32,5,32,6],[32,7,32,8],[32,9,32,10],[32,11,32,12],[37,13,37,14],[50,11,50,14],[37,1,37,2],[37,3,37,4],[37,5,37,6],[37,7,37,8],[37,9,37,10],[37,11,37,12],[34,13,34,14],[35,1,35,2],[35,3,35,4],[35,5,35,6],[35,7,35,8],[35,9,35,10],[35,11,35,12],[35,13,35,14],[34,1,34,2],[34,3,34,4],[34,5,34,6],[34,7,34,8],[34,9,34,10],[34,11,34,12]]}
[]
[null,11,null,2022,null,"불기 2566년   단기 4355년  서기 2022년"]
[null,null,null,{"$f":"TEXT(DATE(D2,B2,1),\"mmmm\")","v":"November"},null,null,null,null,null,null,null,null,null,null,null,null,null,null,"←클릭 전 주의해주세요!"]
[]
[]
[null,{"$f":"IF(연간!$B$2=\"S\",\"SUN\",IF(연간!$B$2=\"M\",\"MON\"))","v":"SUN"},null,{"$f":"IF(연간!$B$2=\"S\",\"MON\",IF(연간!$B$2=\"M\",\"TUE\"))","v":"MON"},null,{"$f":"IF(연간!$B$2=\"S\",\"TUE\",IF(연간!$B$2=\"M\",\"WED\"))","v":"TUE"},null,{"$f":"IF(연간!$B$2=\"S\",\"WED\",IF(연간!$B$2=\"M\",\"THU\"))","v":"WED"},null,{"$f":"IF(연간!$B$2=\"S\",\"THU\",IF(연간!$B$2=\"M\",\"FRI\"))","v":"THU"},null,{"$f":"IF(연간!$B$2=\"S\",\"FRI\",IF(연간!$B$2=\"M\",\"SAT\"))","v":"FRI"},null,{"$f":"IF(연간!$B$2=\"S\",\"SAT\",IF(연간!$B$2=\"M\",\"SUN\"))","v":"SAT"}]
[null,null,{"$f":"IF(연간!$B$2=\"M\",(IF(DAY(DATE($D$2,$B$2,1)-WEEKDAY(DATE($D$2,$B$2,1))+2)=2,DATE($D$2,$B$2,1)-WEEKDAY(DATE($D$2,$B$2,1))-5,DATE($D$2,$B$2,1)-WEEKDAY(DATE($D$2,$B$2,1))+2)),IF(연간!$B$2=\"S\",DATE($D$2,$B$2,1)-WEEKDAY(DATE($D$2,$B$2,1))+1))","v":"2022-10-30"},null,{"$f":"C7+1","v":"2022-10-31"},null,{"$f":"C7+2","v":"2022-11-01"},null,{"$f":"C7+3","v":"2022-11-02"},null,{"$f":"C7+4","v":"2022-11-03"},null,{"$f":"C7+5","v":"2022-11-04"},null,{"$f":"C7+6","v":"2022-11-05"},null,"개인일정"]
[null,{"$f":"TEXT(C7,\"[$-000E0000]m/d\")","v":"10/6"},null,{"$f":"TEXT(E7,\"[$-000E0000]m/d\")","v":"10/7"},null,{"$f":"TEXT(G7,\"[$-000E0000]m/d\")","v":"10/8"},null,{"$f":"TEXT(I7,\"[$-000E0000]m/d\")","v":"10/9"},null,{"$f":"TEXT(K7,\"[$-000E0000]m/d\")","v":"10/10"},null,{"$f":"TEXT(M7,\"[$-000E0000]m/d\")","v":"10/11"},null,{"$f":"TEXT(O7,\"[$-000E0000]m/d\")","v":"10/12"},null,null,"업무일정"]
[null,null,null,null,null,null,null,null,null,null,null,null,null,null,null,null,"중요일정"]
[null,null,null,null,null,null,null,null,null,null,null,null,null,null,null,null,"기념일"]
[]
[]
[null,null,{"$f":"C7+7","v":"2022-11-06"},null,{"$f":"C7+8","v":"2022-11-07"},null,{"$f":"C7+9","v":"2022-11-08"},null,{"$f":"C7+10","v":"2022-11-09"},null,{"$f":"C7+11","v":"2022-11-10"},null,{"$f":"C7+12","v":"2022-11-11"},null,{"$f":"C7+13","v":"2022-11-12"}]
[null,{"$f":"TEXT(C13,\"[$-000E0000]m/d\")","v":"10/13"},null,{"$f":"TEXT(E13,\"[$-000E0000]m/d\")","v":"10/14"},null,{"$f":"TEXT(G13,\"[$-000E0000]m/d\")","v":"10/15"},null,{"$f":"TEXT(I13,\"[$-000E0000]m/d\")","v":"10/16"},null,{"$f":"TEXT(K13,\"[$-000E0000]m/d\")","v":"10/17"},null,{"$f":"TEXT(M13,\"[$-000E0000]m/d\")","v":"10/18"},null,{"$f":"TEXT(O13,\"[$-000E0000]m/d\")","v":"10/19"}]
[]
{"$rows_left_out":4932}
{"sheet":"이름지정","index":5,"n_rows":637,"n_cols":5,"rows_kept":637,"cut":false,"hidden":true,"merged":[]}
["년도","월","연도","날짜","휴일명"]
[2010,1,{"$f":"YEAR(D2)","v":2010},"2010-02-13","설날"]
[2011,2,{"$f":"YEAR(D3)","v":2010},"2010-02-14","설날"]
[2012,3,2010,"2010-02-15","설날"]
[2013,4,2010,"2010-05-21","석가탄신일"]
[2014,5,2010,"2010-09-21","추석"]
[2015,6,2010,"2010-09-22","추석"]
[2016,7,2010,"2010-09-23","추석"]
[2017,8,2011,"2011-02-02","설날"]
[2018,9,2011,"2011-02-03","설날"]
[2019,10,2011,"2011-02-04","설날"]
[2020,11,2011,"2011-05-10","석가탄신일"]
[2021,12,2011,"2011-09-11","추석"]
[2022,null,2011,"2011-09-12","추석"]
[2023,null,2011,"2011-09-13","추석"]
{"$rows_left_out":622}