{"text_format":"1","workbook":"xlsx","n_sheets":6,"sheets":["공휴일","연간","1월","11월","11월 (2)","이름지정"],"not_rendered":{"charts":0,"images":0,"macros":1,"external_links":0,"defined_names":11,"comments":5,"pivot_tables":0},"unopened":[],"bounds":{"document_bytes":16777216,"sheet_cells":100000,"rows_first":2000,"rows_last":500,"rows_between":2000,"halvings":0,"cell_chars":16384,"cell_head_chars":4096},"cells_cut":0,"cells_raw":0,"read":"whole","date_system":"1900"}

{"sheet":"공휴일","index":0,"n_rows":18,"n_cols":4,"rows_kept":18,"cut":false,"hidden":false,"merged":[[0,2,0,3],[0,0,0,1]]}
["공휴일",null,"기념일"]
[{"$f":"DATE(연간!$O$2,1,1)","v":"2022-01-01"},"신정",{"$f":"DATE(연간!$O$2,7,11)","v":"2022-07-11"},"칠석회향"]
[{"$f":"INDEX(날짜,MATCH(연간!$O$2,공휴일연도,0),0)","v":"2022-01-31"},"설날",{"$f":"DATE(연간!$O$2,7,12)","v":"2022-07-12"},"수능100일기도입재"]
[{"$f":"A3+1","v":"2022-02-01"},"설날"]
[{"$f":"A4+1","v":"2022-02-02"},"설날"]
[{"$f":"DATE(연간!$O$2,3,1)","v":"2022-03-01"},"삼일절"]
[{"$f":"DATE(연간!$O$2,5,5)","v":"2022-05-05"},"어린이날"]
[{"$f":"INDEX(날짜,MATCH(1,($B$8=휴일명)*(연간!$O$2=공휴일연도),0))","v":"2022-05-08"},"석가탄신일"]
[{"$f":"DATE(연간!$O$2,6,6)","v":"2022-06-06"},"현충일"]
[{"$f":"DATE(연간!$O$2,8,15)","v":"2022-08-15"},"광복절"]
[{"$f":"INDEX(날짜,MATCH(1,($B$11=휴일명)*(연간!$O$2=공휴일연도),0))","v":"2022-09-09"},"추석"]
[{"$f":"A11+1","v":"2022-09-10"},"추석"]
[{"$f":"A12+1","v":"2022-09-11"},"추석"]
[{"$f":"DATE(연간!$O$2,10,3)","v":"2022-10-03"},"개천절"]
[{"$f":"DATE(연간!$O$2,10,9)","v":"2022-10-09"},"한글날"]
[{"$f":"DATE(연간!$O$2,12,25)","v":"2022-12-25"},"성탄절"]
["2022-09-12","대체공휴일"]
["2022-10-10","대체공휴일"]

{"sheet":"연간","index":1,"n_rows":32,"n_cols":32,"rows_kept":32,"cut":false,"hidden":false,"merged":[[1,14,1,18]]}
[]
[null,"S",null,null,null,null,null,null,null,null,null,null,null,null,2022]
[]
[null,null,null,null,1,null,null,null,null,null,null,null,2,null,null,null,null,null,null,null,3,null,null,null,null,null,null,null,4]
[]
[null,{"$f":"IF($B$2=\"S\",\"S\",IF($B$2=\"M\",\"M\"))","v":"S"},{"$f":"IF($B$2=\"S\",\"M\",IF($B$2=\"M\",\"T\"))","v":"M"},{"$f":"IF($B$2=\"S\",\"T\",IF($B$2=\"M\",\"W\"))","v":"T"},{"$f":"IF($B$2=\"S\",\"W\",IF($B$2=\"M\",\"T\"))","v":"W"},{"$f":"IF($B$2=\"S\",\"T\",IF($B$2=\"M\",\"F\"))","v":"T"},{"$f":"IF($B$2=\"S\",\"F\",IF($B$2=\"M\",\"S\"))","v":"F"},"S",null,{"$f":"IF($B$2=\"S\",\"S\",IF($B$2=\"M\",\"M\"))","v":"S"},{"$f":"IF($B$2=\"S\",\"M\",IF($B$2=\"M\",\"T\"))","v":"M"},{"$f":"IF($B$2=\"S\",\"T\",IF($B$2=\"M\",\"W\"))","v":"T"},{"$f":"IF($B$2=\"S\",\"W\",IF($B$2=\"M\",\"T\"))","v":"W"},{"$f":"IF($B$2=\"S\",\"T\",IF($B$2=\"M\",\"F\"))","v":"T"},{"$f":"IF($B$2=\"S\",\"F\",IF($B$2=\"M\",\"S\"))","v":"F"},"S",null,{"$f":"IF($B$2=\"S\",\"S\",IF($B$2=\"M\",\"M\"))","v":"S"},{"$f":"IF($B$2=\"S\",\"M\",IF($B$2=\"M\",\"T\"))","v":"M"},{"$f":"IF($B$2=\"S\",\"T\",IF($B$2=\"M\",\"W\"))","v":"T"},{"$f":"IF($B$2=\"S\",\"W\",IF($B$2=\"M\",\"T\"))","v":"W"},{"$f":"IF($B$2=\"S\",\"T\",IF($B$2=\"M\",\"F\"))","v":"T"},{"$f":"IF($B$2=\"S\",\"F\",IF($B$2=\"M\",\"S\"))","v":"F"},"S",null,{"$f":"IF($B$2=\"S\",\"S\",IF($B$2=\"M\",\"M\"))","v":"S"},{"$f":"IF($B$2=\"S\",\"M\",IF($B$2=\"M\",\"T\"))","v":"M"},{"$f":"IF($B$2=\"S\",\"T\",IF($B$2=\"M\",\"W\"))","v":"T"},{"$f":"IF($B$2=\"S\",\"W\",IF($B$2=\"M\",\"T\"))","v":"W"},{"$f":"IF($B$2=\"S\",\"T\",IF($B$2=\"M\",\"F\"))","v":"T"},{"$f":"IF($B$2=\"S\",\"F\",IF($B$2=\"M\",\"S\"))","v":"F"},"S"]
[null,{"$f":"IF(B2=\"M\",(IF(DAY(DATE($O$2,$E$4,1)-WEEKDAY(DATE($O$2,$E$4,1))+2)=2,DATE($O$2,$E$4,1)-WEEKDAY(DATE($O$2,$E$4,1))-5,DATE($O$2,$E$4,1)-WEEKDAY(DATE($O$2,$E$4,1))+2)),IF(B2=\"S\",DATE($O$2,$E$4,1)-WEEKDAY(DATE($O$2,$E$4,1))+1))","v":"2021-12-26"},{"$f":"B7+1","v":"2021-12-27"},{"$f":"C7+1","v":"2021-12-28"},"2021-12-29","2021-12-30","2021-12-31","2022-01-01",null,{"$f":"IF(B2=\"M\",(IF(DAY(DATE($O$2,$M$4,1)-WEEKDAY(DATE($O$2,$M$4,1))+2)=2,DATE($O$2,$M$4,1)-WEEKDAY(DATE($O$2,$M$4,1))-5,DATE($O$2,$M$4,1)-WEEKDAY(DATE($O$2,$M$4,1))+2)),IF(B2=\"S\",DATE($O$2,$M$4,1)-WEEKDAY(DATE($O$2,$M$4,1))+1))","v":"2022-01-30"},{"$f":"J7+1","v":"2022-01-31"},{"$f":"K7+1","v":"2022-02-01"},"2022-02-02","2022-02-03","2022-02-04","2022-02-05",null,{"$f":"IF(B2=\"M\",(IF(DAY(DATE($O$2,$U$4,1)-WEEKDAY(DATE($O$2,$U$4,1))+2)=2,DATE($O$2,$U$4,1)-WEEKDAY(DATE($O$2,$U$4,1))-5,DATE($O$2,$U$4,1)-WEEKDAY(DATE($O$2,$U$4,1))+2)),IF(B2=\"S\",DATE($O$2,$U$4,1)-WEEKDAY(DATE($O$2,$U$4,1))+1))","v":"2022-02-27"},{"$f":"R7+1","v":"2022-02-28"},{"$f":"S7+1","v":"2022-03-01"},"2022-03-02","2022-03-03","2022-03-04","2022-03-05",null,{"$f":"IF(B2=\"M\",(IF(DAY(DATE($O$2,$AC$4,1)-WEEKDAY(DATE($O$2,$AC$4,1))+2)=2,DATE($O$2,$AC$4,1)-WEEKDAY(DATE($O$2,$AC$4,1))-5,DATE($O$2,$AC$4,1)-WEEKDAY(DATE($O$2,$AC$4,1))+2)),IF(B2=\"S\",DATE($O$2,$AC$4,1)-WEEKDAY(DATE($O$2,$AC$4,1))+1))","v":"2022-03-27"},{"$f":"Z7+1","v":"2022-03-28"},{"$f":"AA7+1","v":"2022-03-29"},"2022-03-30","2022-03-31","2022-04-01","2022-04-02"]
[null,{"$f":"B7+7","v":"2022-01-02"},{"$f":"C7+7","v":"2022-01-03"},"2022-01-04","2022-01-05","2022-01-06","2022-01-07","2022-01-08",null,{"$f":"J7+7","v":"2022-02-06"},{"$f":"K7+7","v":"2022-02-07"},{"$f":"L7+7","v":"2022-02-08"},{"$f":"M7+7","v":"2022-02-09"},{"$f":"N7+7","v":"2022-02-10"},{"$f":"O7+7","v":"2022-02-11"},{"$f":"P7+7","v":"2022-02-12"},null,{"$f":"R7+7","v":"2022-03-06"},{"$f":"S7+7","v":"2022-03-07"},{"$f":"T7+7","v":"2022-03-08"},{"$f":"U7+7","v":"2022-03-09"},{"$f":"V7+7","v":"2022-03-10"},{"$f":"W7+7","v":"2022-03-11"},{"$f":"X7+7","v":"2022-03-12"},null,{"$f":"Z7+7","v":"2022-04-03"},{"$f":"AA7+7","v":"2022-04-04"},{"$f":"AB7+7","v":"2022-04-05"},{"$f":"AC7+7","v":"2022-04-06"},{"$f":"AD7+7","v":"2022-04-07"},{"$f":"AE7+7","v":"2022-04-08"},{"$f":"AF7+7","v":"2022-04-09"}]
[null,{"$f":"B8+7","v":"2022-01-09"},"2022-01-10","2022-01-11","2022-01-12","2022-01-13","2022-01-14","2022-01-15",null,{"$f":"J8+7","v":"2022-02-13"},"2022-02-14","2022-02-15","2022-02-16","2022-02-17","2022-02-18","2022-02-19",null,{"$f":"R8+7","v":"2022-03-13"},"2022-03-14","2022-03-15","2022-03-16","2022-03-17","2022-03-18","2022-03-19",null,{"$f":"Z8+7","v":"2022-04-10"},"2022-04-11","2022-04-12","2022-04-13","2022-04-14","2022-04-15","2022-04-16"]
[null,{"$f":"B9+7","v":"2022-01-16"},"2022-01-17","2022-01-18","2022-01-19","2022-01-20","2022-01-21","2022-01-22",null,{"$f":"J9+7","v":"2022-02-20"},"2022-02-21","2022-02-22","2022-02-23","2022-02-24","2022-02-25","2022-02-26",null,{"$f":"R9+7","v":"2022-03-20"},"2022-03-21","2022-03-22","2022-03-23","2022-03-24","2022-03-25","2022-03-26",null,{"$f":"Z9+7","v":"2022-04-17"},"2022-04-18","2022-04-19","2022-04-20","2022-04-21","2022-04-22","2022-04-23"]
[null,{"$f":"B10+7","v":"2022-01-23"},"2022-01-24","2022-01-25","2022-01-26","2022-01-27","2022-01-28","2022-01-29",null,{"$f":"J10+7","v":"2022-02-27"},"2022-02-28","2022-03-01","2022-03-02","2022-03-03","2022-03-04","2022-03-05",null,{"$f":"R10+7","v":"2022-03-27"},"2022-03-28","2022-03-29","2022-03-30","2022-03-31","2022-04-01","2022-04-02",null,{"$f":"Z10+7","v":"2022-04-24"},"2022-04-25","2022-04-26","2022-04-27","2022-04-28","2022-04-29","2022-04-30"]
[null,{"$f":"B11+7","v":"2022-01-30"},"2022-01-31","2022-02-01","2022-02-02","2022-02-03","2022-02-04","2022-02-05",null,{"$f":"J11+7","v":"2022-03-06"},"2022-03-07","2022-03-08","2022-03-09","2022-03-10","2022-03-11","2022-03-12",null,{"$f":"R11+7","v":"2022-04-03"},"2022-04-04","2022-04-05","2022-04-06","2022-04-07","2022-04-08","2022-04-09",null,{"$f":"Z11+7","v":"2022-05-01"},"2022-05-02","2022-05-03","2022-05-04","2022-05-05","2022-05-06","2022-05-07"]
[]
[null,null,null,null,5,null,null,null,null,null,null,null,6,null,null,null,null,null,null,null,7,null,null,null,null,null,null,null,8]
[]
[null,{"$f":"IF($B$2=\"S\",\"S\",IF($B$2=\"M\",\"M\"))","v":"S"},{"$f":"IF($B$2=\"S\",\"M\",IF($B$2=\"M\",\"T\"))","v":"M"},{"$f":"IF($B$2=\"S\",\"T\",IF($B$2=\"M\",\"W\"))","v":"T"},{"$f":"IF($B$2=\"S\",\"W\",IF($B$2=\"M\",\"T\"))","v":"W"},{"$f":"IF($B$2=\"S\",\"T\",IF($B$2=\"M\",\"F\"))","v":"T"},{"$f":"IF($B$2=\"S\",\"F\",IF($B$2=\"M\",\"S\"))","v":"F"},"S",null,{"$f":"IF($B$2=\"S\",\"S\",IF($B$2=\"M\",\"M\"))","v":"S"},{"$f":"IF($B$2=\"S\",\"M\",IF($B$2=\"M\",\"T\"))","v":"M"},{"$f":"IF($B$2=\"S\",\"T\",IF($B$2=\"M\",\"W\"))","v":"T"},{"$f":"IF($B$2=\"S\",\"W\",IF($B$2=\"M\",\"T\"))","v":"W"},{"$f":"IF($B$2=\"S\",\"T\",IF($B$2=\"M\",\"F\"))","v":"T"},{"$f":"IF($B$2=\"S\",\"F\",IF($B$2=\"M\",\"S\"))","v":"F"},"S",null,{"$f":"IF($B$2=\"S\",\"S\",IF($B$2=\"M\",\"M\"))","v":"S"},{"$f":"IF($B$2=\"S\",\"M\",IF($B$2=\"M\",\"T\"))","v":"M"},{"$f":"IF($B$2=\"S\",\"T\",IF($B$2=\"M\",\"W\"))","v":"T"},{"$f":"IF($B$2=\"S\",\"W\",IF($B$2=\"M\",\"T\"))","v":"W"},{"$f":"IF($B$2=\"S\",\"T\",IF($B$2=\"M\",\"F\"))","v":"T"},{"$f":"IF($B$2=\"S\",\"F\",IF($B$2=\"M\",\"S\"))","v":"F"},"S",null,{"$f":"IF($B$2=\"S\",\"S\",IF($B$2=\"M\",\"M\"))","v":"S"},{"$f":"IF($B$2=\"S\",\"M\",IF($B$2=\"M\",\"T\"))","v":"M"},{"$f":"IF($B$2=\"S\",\"T\",IF($B$2=\"M\",\"W\"))","v":"T"},{"$f":"IF($B$2=\"S\",\"W\",IF($B$2=\"M\",\"T\"))","v":"W"},{"$f":"IF($B$2=\"S\",\"T\",IF($B$2=\"M\",\"F\"))","v":"T"},{"$f":"IF($B$2=\"S\",\"F\",IF($B$2=\"M\",\"S\"))","v":"F"},"S"]
[null,{"$f":"IF(B2=\"M\",(IF(DAY(DATE($O$2,$E$14,1)-WEEKDAY(DATE($O$2,$E$14,1))+2)=2,DATE($O$2,$E$14,1)-WEEKDAY(DATE($O$2,$E$14,1))-5,DATE($O$2,$E$14,1)-WEEKDAY(DATE($O$2,$E$14,1))+2)),IF(B2=\"S\",DATE($O$2,$E$14,1)-WEEKDAY(DATE($O$2,$E$14,1))+1))","v":"2022-05-01"},{"$f":"B17+1","v":"2022-05-02"},{"$f":"C17+1","v":"2022-05-03"},"2022-05-04","2022-05-05","2022-05-06","2022-05-07",null,{"$f":"IF(B2=\"M\",(IF(DAY(DATE($O$2,$M$14,1)-WEEKDAY(DATE($O$2,$M$14,1))+2)=2,DATE($O$2,$M$14,1)-WEEKDAY(DATE($O$2,$M$14,1))-5,DATE($O$2,$M$14,1)-WEEKDAY(DATE($O$2,$M$14,1))+2)),IF(B2=\"S\",DATE($O$2,$M$14,1)-WEEKDAY(DATE($O$2,$M$14,1))+1))","v":"2022-05-29"},{"$f":"J17+1","v":"2022-05-30"},{"$f":"K17+1","v":"2022-05-31"},"2022-06-01","2022-06-02","2022-06-03","2022-06-04",null,{"$f":"IF(B2=\"M\",(IF(DAY(DATE($O$2,$U$14,1)-WEEKDAY(DATE($O$2,$U$14,1))+2)=2,DATE($O$2,$U$14,1)-WEEKDAY(DATE($O$2,$U$14,1))-5,DATE($O$2,$U$14,1)-WEEKDAY(DATE($O$2,$U$14,1))+2)),IF(B2=\"S\",DATE($O$2,$U$14,1)-WEEKDAY(DATE($O$2,$U$14,1))+1))","v":"2022-06-26"},{"$f":"R17+1","v":"2022-06-27"},{"$f":"S17+1","v":"2022-06-28"},"2022-06-29","2022-06-30","2022-07-01","2022-07-02",null,{"$f":"IF(B2=\"M\",(IF(DAY(DATE($O$2,$AC$14,1)-WEEKDAY(DATE($O$2,$AC$14,1))+2)=2,DATE($O$2,$AC$14,1)-WEEKDAY(DATE($O$2,$AC$14,1))-5,DATE($O$2,$AC$14,1)-WEEKDAY(DATE($O$2,$AC$14,1))+2)),IF(B2=\"S\",DATE($O$2,$AC$14,1)-WEEKDAY(DATE($O$2,$AC$14,1))+1))","v":"2022-07-31"},{"$f":"Z17+1","v":"2022-08-01"},{"$f":"AA17+1","v":"2022-08-02"},"2022-08-03","2022-08-04","2022-08-05","2022-08-06"]
[null,{"$f":"B17+7","v":"2022-05-08"},{"$f":"C17+7","v":"2022-05-09"},{"$f":"D17+7","v":"2022-05-10"},{"$f":"E17+7","v":"2022-05-11"},{"$f":"F17+7","v":"2022-05-12"},{"$f":"G17+7","v":"2022-05-13"},{"$f":"H17+7","v":"2022-05-14"},null,{"$f":"J17+7","v":"2022-06-05"},{"$f":"K17+7","v":"2022-06-06"},{"$f":"L17+7","v":"2022-06-07"},{"$f":"M17+7","v":"2022-06-08"},{"$f":"N17+7","v":"2022-06-09"},{"$f":"O17+7","v":"2022-06-10"},{"$f":"P17+7","v":"2022-06-11"},null,{"$f":"R17+7","v":"2022-07-03"},{"$f":"S17+7","v":"2022-07-04"},{"$f":"T17+7","v":"2022-07-05"},{"$f":"U17+7","v":"2022-07-06"},{"$f":"V17+7","v":"2022-07-07"},{"$f":"W17+7","v":"2022-07-08"},{"$f":"X17+7","v":"2022-07-09"},null,{"$f":"Z17+7","v":"2022-08-07"},{"$f":"AA17+7","v":"2022-08-08"},{"$f":"AB17+7","v":"2022-08-09"},{"$f":"AC17+7","v":"2022-08-10"},{"$f":"AD17+7","v":"2022-08-11"},{"$f":"AE17+7","v":"2022-08-12"},{"$f":"AF17+7","v":"2022-08-13"}]
[null,{"$f":"B18+7","v":"2022-05-15"},"2022-05-16","2022-05-17","2022-05-18","2022-05-19","2022-05-20","2022-05-21",null,{"$f":"J18+7","v":"2022-06-12"},"2022-06-13","2022-06-14","2022-06-15","2022-06-16","2022-06-17","2022-06-18",null,{"$f":"R18+7","v":"2022-07-10"},"2022-07-11","2022-07-12","2022-07-13","2022-07-14","2022-07-15","2022-07-16",null,{"$f":"Z18+7","v":"2022-08-14"},"2022-08-15","2022-08-16","2022-08-17","2022-08-18","2022-08-19","2022-08-20"]
[null,{"$f":"B19+7","v":"2022-05-22"},"2022-05-23","2022-05-24","2022-05-25","2022-05-26","2022-05-27","2022-05-28",null,{"$f":"J19+7","v":"2022-06-19"},"2022-06-20","2022-06-21","2022-06-22","2022-06-23","2022-06-24","2022-06-25",null,{"$f":"R19+7","v":"2022-07-17"},"2022-07-18","2022-07-19","2022-07-20","2022-07-21","2022-07-22","2022-07-23",null,{"$f":"Z19+7","v":"2022-08-21"},"2022-08-22","2022-08-23","2022-08-24","2022-08-25","2022-08-26","2022-08-27"]
[null,{"$f":"B20+7","v":"2022-05-29"},"2022-05-30","2022-05-31","2022-06-01","2022-06-02","2022-06-03","2022-06-04",null,{"$f":"J20+7","v":"2022-06-26"},"2022-06-27","2022-06-28","2022-06-29","2022-06-30","2022-07-01","2022-07-02",null,{"$f":"R20+7","v":"2022-07-24"},"2022-07-25","2022-07-26","2022-07-27","2022-07-28","2022-07-29","2022-07-30",null,{"$f":"Z20+7","v":"2022-08-28"},"2022-08-29","2022-08-30","2022-08-31","2022-09-01","2022-09-02","2022-09-03"]
[null,{"$f":"B21+7","v":"2022-06-05"},"2022-06-06","2022-06-07","2022-06-08","2022-06-09","2022-06-10","2022-06-11",null,{"$f":"J21+7","v":"2022-07-03"},"2022-07-04","2022-07-05","2022-07-06","2022-07-07","2022-07-08","2022-07-09",null,{"$f":"R21+7","v":"2022-07-31"},"2022-08-01","2022-08-02","2022-08-03","2022-08-04","2022-08-05","2022-08-06",null,{"$f":"Z21+7","v":"2022-09-04"},"2022-09-05","2022-09-06","2022-09-07","2022-09-08","2022-09-09","2022-09-10"]
[]
[null,null,null,null,9,null,null,null,null,null,null,null,10,null,null,null,null,null,null,null,11,null,null,null,null,null,null,null,12]
[]
[null,{"$f":"IF($B$2=\"S\",\"S\",IF($B$2=\"M\",\"M\"))","v":"S"},{"$f":"IF($B$2=\"S\",\"M\",IF($B$2=\"M\",\"T\"))","v":"M"},{"$f":"IF($B$2=\"S\",\"T\",IF($B$2=\"M\",\"W\"))","v":"T"},{"$f":"IF($B$2=\"S\",\"W\",IF($B$2=\"M\",\"T\"))","v":"W"},{"$f":"IF($B$2=\"S\",\"T\",IF($B$2=\"M\",\"F\"))","v":"T"},{"$f":"IF($B$2=\"S\",\"F\",IF($B$2=\"M\",\"S\"))","v":"F"},"S",null,{"$f":"IF($B$2=\"S\",\"S\",IF($B$2=\"M\",\"M\"))","v":"S"},{"$f":"IF($B$2=\"S\",\"M\",IF($B$2=\"M\",\"T\"))","v":"M"},{"$f":"IF($B$2=\"S\",\"T\",IF($B$2=\"M\",\"W\"))","v":"T"},{"$f":"IF($B$2=\"S\",\"W\",IF($B$2=\"M\",\"T\"))","v":"W"},{"$f":"IF($B$2=\"S\",\"T\",IF($B$2=\"M\",\"F\"))","v":"T"},{"$f":"IF($B$2=\"S\",\"F\",IF($B$2=\"M\",\"S\"))","v":"F"},"S",null,{"$f":"IF($B$2=\"S\",\"S\",IF($B$2=\"M\",\"M\"))","v":"S"},{"$f":"IF($B$2=\"S\",\"M\",IF($B$2=\"M\",\"T\"))","v":"M"},{"$f":"IF($B$2=\"S\",\"T\",IF($B$2=\"M\",\"W\"))","v":"T"},{"$f":"IF($B$2=\"S\",\"W\",IF($B$2=\"M\",\"T\"))","v":"W"},{"$f":"IF($B$2=\"S\",\"T\",IF($B$2=\"M\",\"F\"))","v":"T"},{"$f":"IF($B$2=\"S\",\"F\",IF($B$2=\"M\",\"S\"))","v":"F"},"S",null,{"$f":"IF($B$2=\"S\",\"S\",IF($B$2=\"M\",\"M\"))","v":"S"},{"$f":"IF($B$2=\"S\",\"M\",IF($B$2=\"M\",\"T\"))","v":"M"},{"$f":"IF($B$2=\"S\",\"T\",IF($B$2=\"M\",\"W\"))","v":"T"},{"$f":"IF($B$2=\"S\",\"W\",IF($B$2=\"M\",\"T\"))","v":"W"},{"$f":"IF($B$2=\"S\",\"T\",IF($B$2=\"M\",\"F\"))","v":"T"},{"$f":"IF($B$2=\"S\",\"F\",IF($B$2=\"M\",\"S\"))","v":"F"},"S"]
[null,{"$f":"IF(B2=\"M\",(IF(DAY(DATE($O$2,$E$24,1)-WEEKDAY(DATE($O$2,$E$24,1))+2)=2,DATE($O$2,$E$24,1)-WEEKDAY(DATE($O$2,$E$24,1))-5,DATE($O$2,$E$24,1)-WEEKDAY(DATE($O$2,$E$24,1))+2)),IF(B2=\"S\",DATE($O$2,$E$24,1)-WEEKDAY(DATE($O$2,$E$24,1))+1))","v":"2022-08-28"},{"$f":"B27+1","v":"2022-08-29"},{"$f":"C27+1","v":"2022-08-30"},"2022-08-31","2022-09-01","2022-09-02","2022-09-03",null,{"$f":"IF(B2=\"M\",(IF(DAY(DATE($O$2,$M$24,1)-WEEKDAY(DATE($O$2,$M$24,1))+2)=2,DATE($O$2,$M$24,1)-WEEKDAY(DATE($O$2,$M$24,1))-5,DATE($O$2,$M$24,1)-WEEKDAY(DATE($O$2,$M$24,1))+2)),IF(B2=\"S\",DATE($O$2,$M$24,1)-WEEKDAY(DATE($O$2,$E$4,1))+1))","v":"2022-09-25"},{"$f":"J27+1","v":"2022-09-26"},{"$f":"K27+1","v":"2022-09-27"},"2022-09-28","2022-09-29","2022-09-30","2022-10-01",null,{"$f":"IF(B2=\"M\",(IF(DAY(DATE($O$2,$U$24,1)-WEEKDAY(DATE($O$2,$U$24,1))+2)=2,DATE($O$2,$U$24,1)-WEEKDAY(DATE($O$2,$U$24,1))-5,DATE($O$2,$U$24,1)-WEEKDAY(DATE($O$2,$U$24,1))+2)),IF(B2=\"S\",DATE($O$2,$U$24,1)-WEEKDAY(DATE($O$2,$U$24,1))+1))","v":"2022-10-30"},{"$f":"R27+1","v":"2022-10-31"},{"$f":"S27+1","v":"2022-11-01"},"2022-11-02","2022-11-03","2022-11-04","2022-11-05",null,{"$f":"IF(B2=\"M\",(IF(DAY(DATE($O$2,$AC$24,1)-WEEKDAY(DATE($O$2,$AC$24,1))+2)=2,DATE($O$2,$AC$24,1)-WEEKDAY(DATE($O$2,$AC$24,1))-5,DATE($O$2,$AC$24,1)-WEEKDAY(DATE($O$2,$AC$24,1))+2)),IF(B2=\"S\",DATE($O$2,$AC$24,1)-WEEKDAY(DATE($O$2,$AC$24,1))+1))","v":"2022-11-27"},{"$f":"Z27+1","v":"2022-11-28"},{"$f":"AA27+1","v":"2022-11-29"},"2022-11-30","2022-12-01","2022-12-02","2022-12-03"]
[null,{"$f":"B27+7","v":"2022-09-04"},{"$f":"C27+7","v":"2022-09-05"},{"$f":"D27+7","v":"2022-09-06"},{"$f":"E27+7","v":"2022-09-07"},{"$f":"F27+7","v":"2022-09-08"},{"$f":"G27+7","v":"2022-09-09"},{"$f":"H27+7","v":"2022-09-10"},null,{"$f":"J27+7","v":"2022-10-02"},{"$f":"K27+7","v":"2022-10-03"},{"$f":"L27+7","v":"2022-10-04"},{"$f":"M27+7","v":"2022-10-05"},{"$f":"N27+7","v":"2022-10-06"},{"$f":"O27+7","v":"2022-10-07"},{"$f":"P27+7","v":"2022-10-08"},null,{"$f":"R27+7","v":"2022-11-06"},{"$f":"S27+7","v":"2022-11-07"},{"$f":"T27+7","v":"2022-11-08"},{"$f":"U27+7","v":"2022-11-09"},{"$f":"V27+7","v":"2022-11-10"},{"$f":"W27+7","v":"2022-11-11"},{"$f":"X27+7","v":"2022-11-12"},null,{"$f":"Z27+7","v":"2022-12-04"},{"$f":"AA27+7","v":"2022-12-05"},{"$f":"AB27+7","v":"2022-12-06"},{"$f":"AC27+7","v":"2022-12-07"},{"$f":"AD27+7","v":"2022-12-08"},{"$f":"AE27+7","v":"2022-12-09"},{"$f":"AF27+7","v":"2022-12-10"}]
[null,{"$f":"B28+7","v":"2022-09-11"},"2022-09-12","2022-09-13","2022-09-14","2022-09-15","2022-09-16","2022-09-17",null,{"$f":"J28+7","v":"2022-10-09"},"2022-10-10","2022-10-11","2022-10-12","2022-10-13","2022-10-14","2022-10-15",null,{"$f":"R28+7","v":"2022-11-13"},"2022-11-14","2022-11-15","2022-11-16","2022-11-17","2022-11-18","2022-11-19",null,{"$f":"Z28+7","v":"2022-12-11"},"2022-12-12","2022-12-13","2022-12-14","2022-12-15","2022-12-16","2022-12-17"]
[null,{"$f":"B29+7","v":"2022-09-18"},"2022-09-19","2022-09-20","2022-09-21","2022-09-22","2022-09-23","2022-09-24",null,{"$f":"J29+7","v":"2022-10-16"},"2022-10-17","2022-10-18","2022-10-19","2022-10-20","2022-10-21","2022-10-22",null,{"$f":"R29+7","v":"2022-11-20"},"2022-11-21","2022-11-22","2022-11-23","2022-11-24","2022-11-25","2022-11-26",null,{"$f":"Z29+7","v":"2022-12-18"},"2022-12-19","2022-12-20","2022-12-21","2022-12-22","2022-12-23","2022-12-24"]
[null,{"$f":"B30+7","v":"2022-09-25"},"2022-09-26","2022-09-27","2022-09-28","2022-09-29","2022-09-30","2022-10-01",null,{"$f":"J30+7","v":"2022-10-23"},"2022-10-24","2022-10-25","2022-10-26","2022-10-27","2022-10-28","2022-10-29",null,{"$f":"R30+7","v":"2022-11-27"},"2022-11-28","2022-11-29","2022-11-30","2022-12-01","2022-12-02","2022-12-03",null,{"$f":"Z30+7","v":"2022-12-25"},"2022-12-26","2022-12-27","2022-12-28","2022-12-29","2022-12-30","2022-12-31"]
[null,{"$f":"B31+7","v":"2022-10-02"},"2022-10-03","2022-10-04","2022-10-05","2022-10-06","2022-10-07","2022-10-08",null,{"$f":"J31+7","v":"2022-10-30"},"2022-10-31","2022-11-01","2022-11-02","2022-11-03","2022-11-04","2022-11-05",null,{"$f":"R31+7","v":"2022-12-04"},"2022-12-05","2022-12-06","2022-12-07","2022-12-08","2022-12-09","2022-12-10",null,{"$f":"Z31+7","v":"2023-01-01"},"2023-01-02","2023-01-03","2023-01-04","2023-01-05","2023-01-06","2023-01-07"]

{"sheet":"1월","index":2,"n_rows":4946,"n_cols":19,"rows_kept":4946,"cut":false,"hidden":false,"merged":[[37,7,37,8],[37,5,37,6],[1,5,3,14],[0,5,0,14],[2,3,3,3],[7,1,7,2],[7,3,7,4],[7,5,7,6],[7,7,7,8],[7,9,7,10],[7,11,7,12],[7,13,7,14],[5,1,5,2],[5,3,5,4],[1,1,3,2],[5,11,5,12],[5,9,5,10],[5,13,5,14],[5,5,5,6],[5,7,5,8],[8,13,8,14],[9,1,9,2],[9,3,9,4],[9,5,9,6],[9,7,9,8],[9,9,9,10],[9,11,9,12],[9,13,9,14],[8,1,8,2],[8,3,8,4],[8,5,8,6],[8,7,8,8],[8,9,8,10],[8,11,8,12],[10,13,10,14],[11,1,11,2],[11,3,11,4],[11,5,11,6],[11,7,11,8],[11,9,11,10],[11,11,11,12],[11,13,11,14],[10,1,10,2],[10,3,10,4],[10,5,10,6],[10,7,10,8],[10,9,10,10],[10,11,10,12],[13,13,13,14],[14,1,14,2],[14,3,14,4],[14,5,14,6],[14,7,14,8],[14,9,14,10],[14,11,14,12],[14,13,14,14],[13,1,13,2],[13,3,13,4],[13,5,13,6],[13,7,13,8],[13,9,13,10],[13,11,13,12],[15,13,15,14],[16,1,16,2],[16,3,16,4],[16,5,16,6],[16,7,16,8],[16,9,16,10],[16,11,16,12],[16,13,16,14],[15,1,15,2],[15,3,15,4],[15,5,15,6],[15,7,15,8],[15,9,15,10],[15,11,15,12],[17,13,17,14],[19,1,19,2],[19,3,19,4],[19,5,19,6],[19,7,19,8],[19,9,19,10],[19,11,19,12],[19,13,19,14],[17,1,17,2],[17,3,17,4],[17,5,17,6],[17,7,17,8],[17,9,17,10],[17,11,17,12],[20,13,20,14],[21,1,21,2],[21,3,21,4],[21,5,21,6],[21,7,21,8],[21,9,21,10],[21,11,21,12],[21,13,21,14],[20,1,20,2],[20,3,20,4],[20,5,20,6],[20,7,20,8],[20,9,20,10],[20,11,20,12],[22,13,22,14],[23,1,23,2],[23,3,23,4],[23,5,23,6],[23,7,23,8],[23,9,23,10],[23,11,23,12],[23,13,23,14],[22,1,22,2],[22,3,22,4],[22,5,22,6],[22,7,22,8],[22,9,22,10],[22,11,22,12],[25,13,25,14],[26,1,26,2],[26,3,26,4],[26,5,26,6],[26,7,26,8],[26,9,26,10],[26,11,26,12],[26,13,26,14],[25,1,25,2],[25,3,25,4],[25,5,25,6],[25,7,25,8],[25,9,25,10],[25,11,25,12],[29,13,29,14],[29,1,29,2],[29,3,29,4],[29,5,29,6],[29,7,29,8],[29,9,29,10],[29,11,29,12],[27,13,27,14],[28,1,28,2],[28,3,28,4],[28,5,28,6],[28,7,28,8],[28,9,28,10],[28,11,28,12],[28,13,28,14],[27,1,27,2],[27,3,27,4],[27,5,27,6],[27,7,27,8],[27,9,27,10],[27,11,27,12],[50,11,50,14],[32,13,32,14],[33,1,33,2],[33,3,33,4],[33,5,33,6],[33,7,33,8],[33,9,33,10],[33,11,33,12],[33,13,33,14],[32,1,32,2],[32,3,32,4],[32,5,32,6],[32,7,32,8],[32,9,32,10],[32,11,32,12],[37,13,37,14],[37,11,37,12],[37,3,37,4],[37,1,37,2],[37,9,37,10],[35,1,35,2],[35,3,35,4],[35,5,35,6],[35,7,35,8],[35,9,35,10],[35,11,35,12],[35,13,35,14],[31,1,31,2],[31,3,31,4],[31,5,31,6],[31,7,31,8],[31,9,31,10],[31,11,31,12],[31,13,31,14],[34,1,34,2],[34,3,34,4],[34,5,34,6],[34,7,34,8],[34,9,34,10],[34,11,34,12],[34,13,34,14]]}
[]
[null,9,null,2022,null,"불기 2566년   단기 4355년  서기 2022년"]
[null,null,null,{"$f":"TEXT(DATE(D2,B2,1),\"mmmm\")","v":"September"},null,null,null,null,null,null,null,null,null,null,null,null,null,null,"←클릭 전 주의해주세요!"]
[]
[null,null,null,null,null,"]"]
[null,{"$f":"IF(연간!$B$2=\"S\",\"SUN\",IF(연간!$B$2=\"M\",\"MON\"))","v":"SUN"},null,{"$f":"IF(연간!$B$2=\"S\",\"MON\",IF(연간!$B$2=\"M\",\"TUE\"))","v":"MON"},null,{"$f":"IF(연간!$B$2=\"S\",\"TUE\",IF(연간!$B$2=\"M\",\"WED\"))","v":"TUE"},null,{"$f":"IF(연간!$B$2=\"S\",\"WED\",IF(연간!$B$2=\"M\",\"THU\"))","v":"WED"},null,{"$f":"IF(연간!$B$2=\"S\",\"THU\",IF(연간!$B$2=\"M\",\"FRI\"))","v":"THU"},null,{"$f":"IF(연간!$B$2=\"S\",\"FRI\",IF(연간!$B$2=\"M\",\"SAT\"))","v":"FRI"},null,{"$f":"IF(연간!$B$2=\"S\",\"SAT\",IF(연간!$B$2=\"M\",\"SUN\"))","v":"SAT"}]
[null,null,{"$f":"IF(연간!$B$2=\"M\",(IF(DAY(DATE($D$2,$B$2,1)-WEEKDAY(DATE($D$2,$B$2,1))+2)=2,DATE($D$2,$B$2,1)-WEEKDAY(DATE($D$2,$B$2,1))-5,DATE($D$2,$B$2,1)-WEEKDAY(DATE($D$2,$B$2,1))+2)),IF(연간!$B$2=\"S\",DATE($D$2,$B$2,1)-WEEKDAY(DATE($D$2,$B$2,1))+1))","v":"2022-08-28"},null,{"$f":"C7+1","v":"2022-08-29"},null,{"$f":"C7+2","v":"2022-08-30"},null,{"$f":"C7+3","v":"2022-08-31"},null,{"$f":"C7+4","v":"2022-09-01"},null,{"$f":"C7+5","v":"2022-09-02"},null,{"$f":"C7+6","v":"2022-09-03"},null,"개인일정"]
[null,{"$f":"TEXT(C7,\"[$-000E0000]m/d\")","v":"8/2"},null,{"$f":"TEXT(E7,\"[$-000E0000]m/d\")","v":"8/3"},null,{"$f":"TEXT(G7,\"[$-000E0000]m/d\")","v":"8/4"},null,{"$f":"TEXT(I7,\"[$-000E0000]m/d\")","v":"8/5"},null,{"$f":"TEXT(K7,\"[$-000E0000]m/d\")","v":"8/6"},null,{"$f":"TEXT(M7,\"[$-000E0000]m/d\")","v":"8/7"},null,{"$f":"TEXT(O7,\"[$-000E0000]m/d\")","v":"8/8"},null,null,"업무일정"]
[null,null,null,null,null,null,null,null,null,null,null,null,null,null,null,null,"중요일정"]
[null,null,null,null,null,null,null,null,null,null,null,null,null,null,null,null,"기념일"]
[]
[]
[null,null,{"$f":"C7+7","v":"2022-09-04"},null,{"$f":"C7+8","v":"2022-09-05"},null,{"$f":"C7+9","v":"2022-09-06"},null,{"$f":"C7+10","v":"2022-09-07"},null,{"$f":"C7+11","v":"2022-09-08"},null,{"$f":"C7+12","v":"2022-09-09"},null,{"$f":"C7+13","v":"2022-09-10"}]
[null,{"$f":"TEXT(C13,\"[$-000E0000]m/d\")","v":"8/9"},null,{"$f":"TEXT(E13,\"[$-000E0000]m/d\")","v":"8/10"},null,{"$f":"TEXT(G13,\"[$-000E0000]m/d\")","v":"8/11"},null,{"$f":"TEXT(I13,\"[$-000E0000]m/d\")","v":"8/12"},null,{"$f":"TEXT(K13,\"[$-000E0000]m/d\")","v":"8/13"},null,{"$f":"TEXT(M13,\"[$-000E0000]m/d\")","v":"8/14"},null,{"$f":"TEXT(O13,\"[$-000E0000]m/d\")","v":"8/15"}]
[]
[]
[]
[]
[null,null,{"$f":"C7+14","v":"2022-09-11"},null,{"$f":"C7+15","v":"2022-09-12"},null,{"$f":"C7+16","v":"2022-09-13"},null,{"$f":"C7+17","v":"2022-09-14"},null,{"$f":"C7+18","v":"2022-09-15"},null,{"$f":"C7+19","v":"2022-09-16"},null,{"$f":"C7+20","v":"2022-09-17"}]
[null,{"$f":"TEXT(C19,\"[$-000E0000]m/d\")","v":"8/16"},null,{"$f":"TEXT(E19,\"[$-000E0000]m/d\")","v":"8/17"},null,{"$f":"TEXT(G19,\"[$-000E0000]m/d\")","v":"8/18"},null,{"$f":"TEXT(I19,\"[$-000E0000]m/d\")","v":"8/19"},null,{"$f":"TEXT(K19,\"[$-000E0000]m/d\")","v":"8/20"},null,{"$f":"TEXT(M19,\"[$-000E0000]m/d\")","v":"8/21"},null,{"$f":"TEXT(O19,\"[$-000E0000]m/d\")","v":"8/22"}]
[]
[]
[]
[]
[null,null,{"$f":"C7+21","v":"2022-09-18"},null,{"$f":"C7+22","v":"2022-09-19"},null,{"$f":"C7+23","v":"2022-09-20"},null,{"$f":"C7+24","v":"2022-09-21"},null,{"$f":"C7+25","v":"2022-09-22"},null,{"$f":"C7+26","v":"2022-09-23"},null,{"$f":"C7+27","v":"2022-09-24"}]
[null,{"$f":"TEXT(C25,\"[$-000E0000]m/d\")","v":"8/23"},null,{"$f":"TEXT(E25,\"[$-000E0000]m/d\")","v":"8/24"},null,{"$f":"TEXT(G25,\"[$-000E0000]m/d\")","v":"8/25"},null,{"$f":"TEXT(I25,\"[$-000E0000]m/d\")","v":"8/26"},null,{"$f":"TEXT(K25,\"[$-000E0000]m/d\")","v":"8/27"},null,{"$f":"TEXT(M25,\"[$-000E0000]m/d\")","v":"8/28"},null,{"$f":"TEXT(O25,\"[$-000E0000]m/d\")","v":"8/29"}]
[]
[]
[]
[]
[null,null,{"$f":"C13+21","v":"2022-09-25"},null,{"$f":"C13+22","v":"2022-09-26"},null,{"$f":"C13+23","v":"2022-09-27"},null,{"$f":"C13+24","v":"2022-09-28"},null,{"$f":"C13+25","v":"2022-09-29"},null,{"$f":"C13+26","v":"2022-09-30"},null,{"$f":"C13+27","v":"2022-10-01"}]
[null,{"$f":"TEXT(C31,\"[$-000E0000]m/d\")","v":"8/30"},null,{"$f":"TEXT(E31,\"[$-000E0000]m/d\")","v":"9/1"},null,{"$f":"TEXT(G31,\"[$-000E0000]m/d\")","v":"9/2"},null,{"$f":"TEXT(I31,\"[$-000E0000]m/d\")","v":"9/3"},null,{"$f":"TEXT(K31,\"[$-000E0000]m/d\")","v":"9/4"},null,{"$f":"TEXT(M31,\"[$-000E0000]m/d\")","v":"9/5"},null,{"$f":"TEXT(O31,\"[$-000E0000]m/d\")","v":"9/6"}]
[]
[]
[]
[]
[null,null,{"$f":"C13+28","v":"2022-10-02"},null,{"$f":"C13+29","v":"2022-10-03"},null,{"$f":"C13+30","v":"2022-10-04"},null,{"$f":"C13+31","v":"2022-10-05"},null,{"$f":"C13+32","v":"2022-10-06"},null,{"$f":"C13+33","v":"2022-10-07"},null,{"$f":"C13+34","v":"2022-10-08"}]
[null,{"$f":"TEXT(C37,\"[$-000E0000]m/d\")","v":"9/7"},null,{"$f":"TEXT(E37,\"[$-000E0000]m/d\")","v":"9/8"},null,{"$f":"TEXT(G37,\"[$-000E0000]m/d\")","v":"9/9"},null,{"$f":"TEXT(I37,\"[$-000E0000]m/d\")","v":"9/10"},null,{"$f":"TEXT(K37,\"[$-000E0000]m/d\")","v":"9/11"},null,{"$f":"TEXT(M37,\"[$-000E0000]m/d\")","v":"9/12"},null,{"$f":"TEXT(O37,\"[$-000E0000]m/d\")","v":"9/13"}]
[]
[]
[]
[]
[1,null,null,null,null,false,null,null,null,null,null,null,null,false]
[2,false,null,false,null,false,null,false,null,false,null,false,null,false]
[3,false,null,false,null,false,null,false,null,false,null,false,null,false]
[4,false,null,false,null,false,null,false,null,false,null,false,null,false]
[5,false,null,false,null,false,null,false,null,false,null,false,null,false]
[6,false,null,false,null,false,null,false,null,false,null,false,null,false]
[]
[]
[]
[]
[]
[]
[]
[]
[]
[]
[]
[]
[]
[]
[]
[]
[]
[]
[]
[]
[]
[]
[]
[]
[]
[]
[]
[]
[]
[]
[]
[]
[]
[]
[]
[]
[]
[]
[]
[]
[]
[]
[]
[]
[]
[]
[]
[]
[]
[]
[]
[]
[]
[]
[]
[]
[]
[]
[]
[]
[]
[]
[]
[]
[]
[]
[]
[]
[]
[]
[]
[]
[]
[]
[]
[]
[]
[]
[]
[]
[]
[]
[]
[]
[]
[]
[]
[]
[]
[]
[]
[]
[]
[]
[]
[]
[]
[]
[]
[]
[]
[]
[]
[]
[]
[]
[]
[]
[]
[]
[]
[]
[]
[]
[]
[]
[]
[]
[]
[]
[]
[]
[]
[]
[]
[]
[]
[]
[]
[]
[]
[]
[]
[]
[]
[]
[]
[]
[]
[]
[]
[]
[]
[]
[]
[]
[]
[]
[]
[]
[]
[]
[]
[]
[]
[]
[]
[]
[]
[]
[]
[]
[]
[]
[]
[]
[]
[]
[]
[]
[]
[]
[]
[]
[]
[]
[]
[]
[]
[]
[]
[]
[]
[]
[]
[]
[]
[]
[]
[]
[]
[]
[]
[]
[]
[]
[]
[]
[]
[]
[]
[]
[]
[]
[]
[]
[]
[]
[]
[]
[]
[]
[]
[]
[]
[]
[]
[]
[]
[]
[]
[]
[]
[]
[]
[]
[]
[]
[]
[]
[]
[]
[]
[]
[]
[]
[]
[]
[]
[]
[]
[]
[]
[]
[]
[]
[]
[]
[]
[]
[]
[]
[]
[]
[]
[]
[]
[]
[]
[]
[]
[]
[]
[]
[]
[]
[]
[]
[]
[]
[]
[]
[]
[]
[]
[]
[]
[]
[]
[]
[]
[]
[]
[]
[]
[]
[]
[]
[]
[]
[]
[]
[]
[]
[]
[]
[]
[]
[]
[]
[]
[]
[]
[]
[]
[]
[]
[]
[]
[]
[]
[]
[]
[]
[]
[]
[]
[]
[]
[]
[]
[]
[]
[]
[]
[]
[]
[]
[]
[]
[]
[]
[]
[]
[]
[]
[]
[]
[]
[]
[]
[]
[]
[]
[]
[]
[]
[]
[]
[]
[]
[]
[]
[]
[]
[]
[]
[]
[]
[]
[]
[]
[]
[]
[]
[]
[]
[]
[]
[]
[]
[]
[]
[]
[]
[]
[]
[]
[]
[]
[]
[]
[]
[]
[]
[]
[]
[]
[]
[]
[]
[]
[]
[]
[]
[]
[]
[]
[]
[]
[]
[]
[]
[]
[]
[]
[]
[]
[]
[]
[]
[]
[]
[]
[]
[]
[]
[]
[]
[]
[]
[]
[]
[]
[]
[]
[]
[]
[]
[]
[]
[]
[]
[]
[]
[]
[]
[]
[]
[]
[]
[]
[]
[]
[]
[]
[]
[]
[]
[]
[]
[]
[]
[]
[]
[]
[]
[]
[]
[]
[]
[]
[]
[]
[]
[]
[]
[]
[]
[]
[]
[]
[]
[]
[]
[]
[]
[]
[]
[]
[]
[]
[]
[]
[]
[]
[]
[]
[]
[]
[]
[]
[]
[]
[]
[]
[]
[]
[]
[]
[]
[]
[]
[]
[]
[]
[]
[]
[]
[]
[]
[]
[]
[]
[]
[]
[]
[]
[]
[]
[]
[]
[]
[]
[]
[]
[]
[]
[]
[]
[]
[]
[]
[]
[]
[]
[]
[]
[]
[]
[]
[]
[]
[]
[]
[]
[]
[]
[]
[]
[]
[]
[]
[]
[]
[]
[]
[]
[]
[]
[]
[]
[]
[]
[]
[]
[]
[]
[]
[]
[]
[]
[]
[]
[]
[]
[]
[]
[]
[]
[]
[]
[]
[]
[]
[]
[]
[]
[]
[]
[]
[]
[]
[]
[]
[]
[]
[]
[]
[]
[]
[]
[]
[]
[]
[]
[]
[]
[]
[]
[]
[]
[]
[]
[]
[]
[]
[]
[]
[]
[]
[]
[]
[]
[]
[]
[]
[]
[]
[]
[]
[]
[]
[]
[]
[]
[]
[]
[]
[]
[]
[]
[]
[]
[]
[]
[]
[]
[]
[]
[]
[]
[]
[]
[]
[]
[]
[]
[]
[]
[]
[]
[]
[]
[]
[]
[]
[]
[]
[]
[]
[]
[]
[]
[]
[]
[]
[]
[]
[]
[]
[]
[]
[]
[]
[]
[]
[]
[]
[]
[]
[]
[]
[]
[]
[]
[]
[]
[]
[]
[]
[]
[]
[]
[]
[]
[]
[]
[]
[]
[]
[]
[]
[]
[]
[]
[]
[]
[]
[]
[]
[]
[]
[]
[]
[]
[]
[]
[]
[]
[]
[]
[]
[]
[]
[]
[]
[]
[]
[]
[]
[]
[]
[]
[]
[]
[]
[]
[]
[]
[]
[]
[]
[]
[]
[]
[]
[]
[]
[]
[]
[]
[]
[]
[]
[]
[]
[]
[]
[]
[]
[]
[]
[]
[]
[]
[]
[]
[]
[]
[]
[]
[]
[]
[]
[]
[]
[]
[]
[]
[]
[]
[]
[]
[]
[]
[]
[]
[]
[]
[]
[]
[]
[]
[]
[]
[]
[]
[]
[]
[]
[]
[]
[]
[]
[]
[]
[]
[]
[]
[]
[]
[]
[]
[]
[]
[]
[]
[]
[]
[]
[]
[]
[]
[]
[]
[]
[]
[]
[]
[]
[]
[]
[]
[]
[]
[]
[]
[]
[]
[]
[]
[]
[]
[]
[]
[]
[]
[]
[]
[]
[]
[]
[]
[]
[]
[]
[]
[]
[]
[]
[]
[]
[]
[]
[]
[]
[]
[]
[]
[]
[]
[]
[]
[]
[]
[]
[]
[]
[]
[]
[]
[]
[]
[]
[]
[]
[]
[]
[]
[]
[]
[]
[]
[]
[]
[]
[]
[]
[]
[]
[]
[]
[]
[]
[]
[]
[]
[]
[]
[]
[]
[]
[]
[]
[]
[]
[]
[]
[]
[]
[]
[]
[]
[]
[]
[]
[]
[]
[]
[]
[]
[]
[]
[]
[]
[]
[]
[]
[]
[]
[]
[]
[]
[]
[]
[]
[]
[]
[]
[]
[]
[]
[]
[]
[]
[]
[]
[]
[]
[]
[]
[]
[]
[]
[]
[]
[]
[]
[]
[]
[]
[]
[]
[]
[]
[]
[]
[]
[]
[]
[]
[]
[]
[]
[]
[]
[]
[]
[]
[]
[]
[]
[]
[]
[]
[]
[]
[]
[]
[]
[]
[]
[]
[]
[]
[]
[]
[]
[]
[]
[]
[]
[]
[]
[]
[]
[]
[]
[]
[]
[]
[]
[]
[]
[]
[]
[]
[]
[]
[]
[]
[]
[]
[]
[]
[]
[]
[]
[]
[]
[]
[]
[]
[]
[]
[]
[]
[]
[]
[]
[]
[]
[]
[]
[]
[]
[]
[]
[]
[]
[]
[]
[]
[]
[]
[]
[]
[]
[]
[]
[]
[]
[]
[]
[]
[]
[]
[]
[]
[]
[]
[]
[]
[]
[]
[]
[]
[]
[]
[]
[]
[]
[]
[]
[]
[]
[]
[]
[]
[]
[]
[]
[]
[]
[]
[]
[]
[]
[]
[]
[]
[]
[]
[]
[]
[]
[]
[]
[]
[]
[]
[]
[]
[]
[]
[]
[]
[]
[]
[]
[]
[]
[]
[]
[]
[]
[]
[]
[]
[]
[]
[]
[]
[]
[]
[]
[]
[]
[]
[]
[]
[]
[]
[]
[]
[]
[]
[]
[]
[]
[]
[]
[]
[]
[]
[]
[]
[]
[]
[]
[]
[]
[]
[]
[]
[]
[]
[]
[]
[]
[]
[]
[]
[]
[]
[]
[]
[]
[]
[]
[]
[]
[]
[]
[]
[]
[]
[]
[]
[]
[]
[]
[]
[]
[]
[]
[]
[]
[]
[]
[]
[]
[]
[]
[]
[]
[]
[]
[]
[]
[]
[]
[]
[]
[]
[]
[]
[]
[]
[]
[]
[]
[]
[]
[]
[]
[]
[]
[]
[]
[]
[]
[]
[]
[]
[]
[]
[]
[]
[]
[]
[]
[]
[]
[]
[]
[]
[]
[]
[]
[]
[]
[]
[]
[]
[]
[]
[]
[]
[]
[]
[]
[]
[]
[]
[]
[]
[]
[]
[]
[]
[]
[]
[]
[]
[]
[]
[]
[]
[]
[]
[]
[]
[]
[]
[]
[]
[]
[]
[]
[]
[]
[]
[]
[]
[]
[]
[]
[]
[]
[]
[]
[]
[]
[]
[]
[]
[]
[]
[]
[]
[]
[]
[]
[]
[]
[]
[]
[]
[]
[]
[]
[]
[]
[]
[]
[]
[]
[]
[]
[]
[]
[]
[]
[]
[]
[]
[]
[]
[]
[]
[]
[]
[]
[]
[]
[]
[]
[]
[]
[]
[]
[]
[]
[]
[]
[]
[]
[]
[]
[]
[]
[]
[]
[]
[]
[]
[]
[]
[]
[]
[]
[]
[]
[]
[]
[]
[]
[]
[]
[]
[]
[]
[]
[]
[]
[]
[]
[]
[]
[]
[]
[]
[]
[]
[]
[]
[]
[]
[]
[]
[]
[]
[]
[]
[]
[]
[]
[]
[]
[]
[]
[]
[]
[]
[]
[]
[]
[]
[]
[]
[]
[]
[]
[]
[]
[]
[]
[]
[]
[]
[]
[]
[]
[]
[]
[]
[]
[]
[]
[]
[]
[]
[]
[]
[]
[]
[]
[]
[]
[]
[]
[]
[]
[]
[]
[]
[]
[]
[]
[]
[]
[]
[]
[]
[]
[]
[]
[]
[]
[]
[]
[]
[]
[]
[]
[]
[]
[]
[]
[]
[]
[]
[]
[]
[]
[]
[]
[]
[]
[]
[]
[]
[]
[]
[]
[]
[]
[]
[]
[]
[]
[]
[]
[]
[]
[]
[]
[]
[]
[]
[]
[]
[]
[]
[]
[]
[]
[]
[]
[]
[]
[]
[]
[]
[]
[]
[]
[]
[]
[]
[]
[]
[]
[]
[]
[]
[]
[]
[]
[]
[]
[]
[]
[]
[]
[]
[]
[]
[]
[]
[]
[]
[]
[]
[]
[]
[]
[]
[]
[]
[]
[]
[]
[]
[]
[]
[]
[]
[]
[]
[]
[]
[]
[]
[]
[]
[]
[]
[]
[]
[]
[]
[]
[]
[]
[]
[]
[]
[]
[]
[]
[]
[]
[]
[]
[]
[]
[]
[]
[]
[]
[]
[]
[]
[]
[]
[]
[]
[]
[]
[]
[]
[]
[]
[]
[]
[]
[]
[]
[]
[]
[]
[]
[]
[]
[]
[]
[]
[]
[]
[]
[]
[]
[]
[]
[]
[]
[]
[]
[]
[]
[]
[]
[]
[]
[]
[]
[]
[]
[]
[]
[]
[]
[]
[]
[]
[]
[]
[]
[]
[]
[]
[]
[]
[]
[]
[]
[]
[]
[]
[]
[]
[]
[]
[]
[]
[]
[]
[]
[]
[]
[]
[]
[]
[]
[]
[]
[]
[]
[]
[]
[]
[]
[]
[]
[]
[]
[]
[]
[]
[]
[]
[]
[]
[]
[]
[]
[]
[]
[]
[]
[]
[]
[]
[]
[]
[]
[]
[]
[]
[]
[]
[]
[]
[]
[]
[]
[]
[]
[]
[]
[]
[]
[]
[]
[]
[]
[]
[]
[]
[]
[]
[]
[]
[]
[]
[]
[]
[]
[]
[]
[]
[]
[]
[]
[]
[]
[]
[]
[]
[]
[]
[]
[]
[]
[]
[]
[]
[]
[]
[]
[]
[]
[]
[]
[]
[]
[]
[]
[]
[]
[]
[]
[]
[]
[]
[]
[]
[]
[]
[]
[]
[]
[]
[]
[]
[]
[]
[]
[]
[]
[]
[]
[]
[]
[]
[]
[]
[]
[]
[]
[]
[]
[]
[]
[]
[]
[]
[]
[]
[]
[]
[]
[]
[]
[]
[]
[]
[]
[]
[]
[]
[]
[]
[]
[]
[]
[]
[]
[]
[]
[]
[]
[]
[]
[]
[]
[]
[]
[]
[]
[]
[]
[]
[]
[]
[]
[]
[]
[]
[]
[]
[]
[]
[]
[]
[]
[]
[]
[]
[]
[]
[]
[]
[]
[]
[]
[]
[]
[]
[]
[]
[]
[]
[]
[]
[]
[]
[]
[]
[]
[]
[]
[]
[]
[]
[]
[]
[]
[]
[]
[]
[]
[]
[]
[]
[]
[]
[]
[]
[]
[]
[]
[]
[]
[]
[]
[]
[]
[]
[]
[]
[]
[]
[]
[]
[]
[]
[]
[]
[]
[]
[]
[]
[]
[]
[]
[]
[]
[]
[]
[]
[]
[]
[]
[]
[]
[]
[]
[]
[]
[]
[]
[]
[]
[]
[]
[]
[]
[]
[]
[]
[]
[]
[]
[]
[]
[]
[]
[]
[]
[]
[]
[]
[]
[]
[]
[]
[]
[]
[]
[]
[]
[]
[]
[]
[]
[]
[]
[]
[]
[]
[]
[]
[]
[]
[]
[]
[]
[]
[]
[]
[]
[]
[]
[]
[]
[]
[]
[]
[]
[]
[]
[]
[]
[]
[]
[]
[]
[]
[]
[]
[]
[]
[]
[]
[]
[]
[]
[]
[]
[]
[]
[]
[]
[]
[]
[]
[]
[]
[]
[]
[]
[]
[]
[]
[]
[]
[]
[]
[]
[]
[]
[]
[]
[]
[]
[]
[]
[]
[]
[]
[]
[]
[]
[]
[]
[]
[]
[]
[]
[]
[]
[]
[]
[]
[]
[]
[]
[]
[]
[]
[]
[]
[]
[]
[]
[]
[]
[]
[]
[]
[]
[]
[]
[]
[]
[]
[]
[]
[]
[]
[]
[]
[]
[]
[]
[]
[]
[]
[]
[]
[]
[]
[]
[]
[]
[]
[]
[]
[]
[]
[]
[]
[]
[]
[]
[]
[]
[]
[]
[]
[]
[]
[]
[]
[]
[]
[]
[]
[]
[]
[]
[]
[]
[]
[]
[]
[]
[]
[]
[]
[]
[]
[]
[]
[]
[]
[]
[]
[]
[]
[]
[]
[]
[]
[]
[]
[]
[]
[]
[]
[]
[]
[]
[]
[]
[]
[]
[]
[]
[]
[]
[]
[]
[]
[]
[]
[]
[]
[]
[]
[]
[]
[]
[]
[]
[]
[]
[]
[]
[]
[]
[]
[]
[]
[]
[]
[]
[]
[]
[]
[]
[]
[]
[]
[]
[]
[]
[]
[]
[]
[]
[]
[]
[]
[]
[]
[]
[]
[]
[]
[]
[]
[]
[]
[]
[]
[]
[]
[]
[]
[]
[]
[]
[]
[]
[]
[]
[]
[]
[]
[]
[]
[]
[]
[]
[]
[]
[]
[]
[]
[]
[]
[]
[]
[]
[]
[]
[]
[]
[]
[]
[]
[]
[]
[]
[]
[]
[]
[]
[]
[]
[]
[]
[]
[]
[]
[]
[]
[]
[]
[]
[]
[]
[]
[]
[]
[]
[]
[]
[]
[]
[]
[]
[]
[]
[]
[]
[]
[]
[]
[]
[]
[]
[]
[]
[]
[]
[]
[]
[]
[]
[]
[]
[]
[]
[]
[]
[]
[]
[]
[]
[]
[]
[]
[]
[]
[]
[]
[]
[]
[]
[]
[]
[]
[]
[]
[]
[]
[]
[]
[]
[]
[]
[]
[]
[]
[]
[]
[]
[]
[]
[]
[]
[]
[]
[]
[]
[]
[]
[]
[]
[]
[]
[]
[]
[]
[]
[]
[]
[]
[]
[]
[]
[]
[]
[]
[]
[]
[]
[]
[]
[]
[]
[]
[]
[]
[]
[]
[]
[]
[]
[]
[]
[]
[]
[]
[]
[]
[]
[]
[]
[]
[]
[]
[]
[]
[]
[]
[]
[]
[]
[]
[]
[]
[]
[]
[]
[]
[]
[]
[]
[]
[]
[]
[]
[]
[]
[]
[]
[]
[]
[]
[]
[]
[]
[]
[]
[]
[]
[]
[]
[]
[]
[]
[]
[]
[]
[]
[]
[]
[]
[]
[]
[]
[]
[]
[]
[]
[]
[]
[]
[]
[]
[]
[]
[]
[]
[]
[]
[]
[]
[]
[]
[]
[]
[]
[]
[]
[]
[]
[]
[]
[]
[]
[]
[]
[]
[]
[]
[]
[]
[]
[]
[]
[]
[]
[]
[]
[]
[]
[]
[]
[]
[]
[]
[]
[]
[]
[]
[]
[]
[]
[]
[]
[]
[]
[]
[]
[]
[]
[]
[]
[]
[]
[]
[]
[]
[]
[]
[]
[]
[]
[]
[]
[]
[]
[]
[]
[]
[]
[]
[]
[]
[]
[]
[]
[]
[]
[]
[]
[]
[]
[]
[]
[]
[]
[]
[]
[]
[]
[]
[]
[]
[]
[]
[]
[]
[]
[]
[]
[]
[]
[]
[]
[]
[]
[]
[]
[]
[]
[]
[]
[]
[]
[]
[]
[]
[]
[]
[]
[]
[]
[]
[]
[]
[]
[]
[]
[]
[]
[]
[]
[]
[]
[]
[]
[]
[]
[]
[]
[]
[]
[]
[]
[]
[]
[]
[]
[]
[]
[]
[]
[]
[]
[]
[]
[]
[]
[]
[]
[]
[]
[]
[]
[]
[]
[]
[]
[]
[]
[]
[]
[]
[]
[]
[]
[]
[]
[]
[]
[]
[]
[]
[]
[]
[]
[]
[]
[]
[]
[]
[]
[]
[]
[]
[]
[]
[]
[]
[]
[]
[]
[]
[]
[]
[]
[]
[]
[]
[]
[]
[]
[]
[]
[]
[]
[]
[]
[]
[]
[]
[]
[]
[]
[]
[]
[]
[]
[]
[]
[]
[]
[]
[]
[]
[]
[]
[]
[]
[]
[]
[]
[]
[]
[]
[]
[]
[]
[]
[]
[]
[]
[]
[]
[]
[]
[]
[]
[]
[]
[]
[]
[]
[]
[]
[]
[]
[]
[]
[]
[]
[]
[]
[]
[]
[]
[]
[]
[]
[]
[]
[]
[]
[]
[]
[]
[]
[]
[]
[]
[]
[]
[]
[]
[]
[]
[]
[]
[]
[]
[]
[]
[]
[]
[]
[]
[]
[]
[]
[]
[]
[]
[]
[]
[]
[]
[]
[]
[]
[]
[]
[]
[]
[]
[]
[]
[]
[]
[]
[]
[]
[]
[]
[]
[]
[]
[]
[]
[]
[]
[]
[]
[]
[]
[]
[]
[]
[]
[]
[]
[]
[]
[]
[]
[]
[]
[]
[]
[]
[]
[]
[]
[]
[]
[]
[]
[]
[]
[]
[]
[]
[]
[]
[]
[]
[]
[]
[]
[]
[]
[]
[]
[]
[]
[]
[]
[]
[]
[]
[]
[]
[]
[]
[]
[]
[]
[]
[]
[]
[]
[]
[]
[]
[]
[]
[]
[]
[]
[]
[]
[]
[]
[]
[]
[]
[]
[]
[]
[]
[]
[]
[]
[]
[]
[]
[]
[]
[]
[]
[]
[]
[]
[]
[]
[]
[]
[]
[]
[]
[]
[]
[]
[]
[]
[]
[]
[]
[]
[]
[]
[]
[]
[]
[]
[]
[]
[]
[]
[]
[]
[]
[]
[]
[]
[]
[]
[]
[]
[]
[]
[]
[]
[]
[]
[]
[]
[]
[]
[]
[]
[]
[]
[]
[]
[]
[]
[]
[]
[]
[]
[]
[]
[]
[]
[]
[]
[]
[]
[]
[]
[]
[]
[]
[]
[]
[]
[]
[]
[]
[]
[]
[]
[]
[]
[]
[]
[]
[]
[]
[]
[]
[]
[]
[]
[]
[]
[]
[]
[]
[]
[]
[]
[]
[]
[]
[]
[]
[]
[]
[]
[]
[]
[]
[]
[]
[]
[]
[]
[]
[]
[]
[]
[]
[]
[]
[]
[]
[]
[]
[]
[]
[]
[]
[]
[]
[]
[]
[]
[]
[]
[]
[]
[]
[]
[]
[]
[]
[]
[]
[]
[]
[]
[]
[]
[]
[]
[]
[]
[]
[]
[]
[]
[]
[]
[]
[]
[]
[]
[]
[]
[]
[]
[]
[]
[]
[]
[]
[]
[]
[]
[]
[]
[]
[]
[]
[]
[]
[]
[]
[]
[]
[]
[]
[]
[]
[]
[]
[]
[]
[]
[]
[]
[]
[]
[]
[]
[]
[]
[]
[]
[]
[]
[]
[]
[]
[]
[]
[]
[]
[]
[]
[]
[]
[]
[]
[]
[]
[]
[]
[]
[]
[]
[]
[]
[]
[]
[]
[]
[]
[]
[]
[]
[]
[]
[]
[]
[]
[]
[]
[]
[]
[]
[]
[]
[]
[]
[]
[]
[]
[]
[]
[]
[]
[]
[]
[]
[]
[]
[]
[]
[]
[]
[]
[]
[]
[]
[]
[]
[]
[]
[]
[]
[]
[]
[]
[]
[]
[]
[]
[]
[]
[]
[]
[]
[]
[]
[]
[]
[]
[]
[]
[]
[]
[]
[]
[]
[]
[]
[]
[]
[]
[]
[]
[]
[]
[]
[]
[]
[]
[]
[]
[]
[]
[]
[]
[]
[]
[]
[]
[]
[]
[]
[]
[]
[]
[]
[]
[]
[]
[]
[]
[]
[]
[]
[]
[]
[]
[]
[]
[]
[]
[]
[]
[]
[]
[]
[]
[]
[]
[]
[]
[]
[]
[]
[]
[]
[]
[]
[]
[]
[]
[]
[]
[]
[]
[]
[]
[]
[]
[]
[]
[]
[]
[]
[]
[]
[]
[]
[]
[]
[]
[]
[]
[]
[]
[]
[]
[]
[]
[]
[]
[]
[]
[]
[]
[]
[]
[]
[]
[]
[]
[]
[]
[]
[]
[]
[]
[]
[]
[]
[]
[]
[]
[]
[]
[]
[]
[]
[]
[]
[]
[]
[]
[]
[]
[]
[]
[]
[]
[]
[]
[]
[]
[]
[]
[]
[]
[]
[]
[]
[]
[]
[]
[]
[]
[]
[]
[]
[]
[]
[]
[]
[]
[]
[]
[]
[]
[]
[]
[]
[]
[]
[]
[]
[]
[]
[]
[]
[]
[]
[]
[]
[]
[]
[]
[]
[]
[]
[]
[]
[]
[]
[]
[]
[]
[]
[]
[]
[]
[]
[]
[]
[]
[]
[]
[]
[]
[]
[]
[]
[]
[]
[]
[]
[]
[]
[]
[]
[]
[]
[]
[]
[]
[]
[]
[]
[]
[]
[]
[]
[]
[]
[]
[]
[]
[]
[]
[]
[]
[]
[]
[]
[]
[]
[]
[]
[]
[]
[]
[]
[]
[]
[]
[]
[]
[]
[]
[]
[]
[]
[]
[]
[]
[]
[]
[]
[]
[]
[]
[]
[]
[]
[]
[]
[]
[]
[]
[]
[]
[]
[]
[]
[]
[]
[]
[]
[]
[]
[]
[]
[]
[]
[]
[]
[]
[]
[]
[]
[]
[]
[]
[]
[]
[]
[]
[]
[]
[]
[]
[]
[]
[]
[]
[]
[]
[]
[]
[]
[]
[]
[]
[]
[]
[]
[]
[]
[]
[]
[]
[]
[]
[]
[]
[]
[]
[]
[]
[]
[]
[]
[]
[]
[]
[]
[]
[]
[]
[]
[]
[]
[]
[]
[]
[]
[]
[]
[]
[]
[]
[]
[]
[]
[]
[]
[]
[]
[]
[]
[]
[]
[]
[]
[]
[]
[]
[]
[]
[]
[]
[]
[]
[]
[]
[]
[]
[]
[]
[]
[]
[]
[]
[]
[]
[]
[]
[]
[]
[]
[]
[]
[]
[]
[]
[]
[]
[]
[]
[]
[]
[]
[]
[]
[]
[]
[]
[]
[]
[]
[]
[]
[]
[]
[]
[]
[]
[]
[]
[]
[]
[]
[]
[]
[]
[]
[]
[]
[]
[]
[]
[]
[]
[]
[]
[]
[]
[]
[]
[]
[]
[]
[]
[]
[]
[]
[]
[]
[]
[]
[]
[]
[]
[]
[]
[]
[]
[]
[]
[]
[]
[]
[]
[]
[]
[]
[]
[]
[]
[]
[]
[]
[]
[]
[]
[]
[]
[]
[]
[]
[]
[]
[]
[]
[]
[]
[]
[]
[]
[]
[]
[]
[]
[]
[]
[]
[]
[]
[]
[]
[]
[]
[]
[]
[]
[]
[]
[]
[]
[]
[]
[]
[]
[]
[]
[]
[]
[]
[]
[]
[]
[]
[]
[]
[]
[]
[]
[]
[]
[]
[]
[]
[]
[]
[]
[]
[]
[]
[]
[]
[]
[]
[]
[]
[]
[]
[]
[]
[]
[]
[]
[]
[]
[]
[]
[]
[]
[]
[]
[]
[]
[]
[]
[]
[]
[]
[]
[]
[]
[]
[]
[]
[]
[]
[]
[]
[]
[]
[]
[]
[]
[]
[]
[]
[]
[]
[]
[]
[]
[]
[]
[]
[]
[]
[]
[]
[]
[]
[]
[]
[]
[]
[]
[]
[]
[]
[]
[]
[]
[]
[]
[]
[]
[]
[]
[]
[]
[]
[]
[]
[]
[]
[]
[]
[]
[]
[]
[]
[]
[]
[]
[]
[]
[]
[]
[]
[]
[]
[]
[]
[]
[]
[]
[]
[]
[]
[]
[]
[]
[]
[]
[]
[]
[]
[]
[]
[]
[]
[]
[]
[]
[]
[]
[]
[]
[]
[]
[]
[]
[]
[]
[]
[]
[]
[]
[]
[]
[]
[]
[]
[]
[]
[]
[]
[]
[]
[]
[]
[]
[]
[]
[]
[]
[]
[]
[]
[]
[]
[]
[]
[]
[]
[]
[]
[]
[]
[]
[]
[]
[]
[]
[]
[]
[]
[]
[]
[]
[]
[]
[]
[]
[]
[]
[]
[]
[]
[]
[]
[]
[]
[]
[]
[]
[]
[]
[]
[]
[]
[]
[]
[]
[]
[]
[]
[]
[]
[]
[]
[]
[]
[]
[]
[]
[]
[]
[]
[]
[]
[]
[]
[]
[]
[]
[]
[]
[]
[]
[]
[]
[]
[]
[]
[]
[]
[]
[]
[]
[]
[]
[]
[]
[]
[]
[]
[]
[]
[]
[]
[]
[]
[]
[]
[]
[]
[]
[]
[]
[]
[]
[]
[]
[]
[]
[]
[]
[]
[]
[]
[]
[]
[]
[]
[]
[]
[]
[]
[]
[]
[]
[]
[]
[]
[]
[]
[]
[]
[]
[]
[]
[]
[]
[]
[]
[]
[]
[]
[]
[]
[]
[]
[]
[]
[]
[]
[]
[]
[]
[]
[]
[]
[]
[]
[]
[]
[]
[]
[]
[]
[]
[]
[]
[]
[]
[]
[]
[]
[]
[]
[]
[]
[]
[]
[]
[]
[]
[]
[]
[]
[]
[]
[]
[]
[]
[]
[]
[]
[]
[]
[]
[]
[]
[]
[]
[]
[]
[]
[]
[]
[]
[]
[]
[]
[]
[]
[]
[]
[]
[]
[]
[]
[]
[]
[]
[]
[]
[]
[]
[]
[]
[]
[]
[]
[]
[]
[]
[]
[]
[]
[]
[]
[]
[]
[]
[]
[]
[]
[]
[]
[]
[]
[]
[]
[]
[]
[]
[]
[]
[]
[]
[]
[]
[]
[]
[]
[]
[]
[]
[]
[]
[]
[]
[]
[]
[]
[]
[]
[]
[]
[]
[]
[]
[]
[]
[]
[]
[]
[]
[]
[]
[]
[]
[]
[]
[]
[]
[]
[]
[]
[]
[]
[]
[]
[]
[]
[]
[]
[]
[]
[]
[]
[]
[]
[]
[]
[]
[]
[]
[]
[]
[]
[]
[]
[]
[]
[]
[]
[]
[]
[]
[]
[]
[]
[]
[]
[]
[]
[]
[]
[]
[]
[]
[]
[]
[]
[]
[]
[]
[]
[]
[]
[]
[]
[]
[]
[]
[]
[]
[]
[]
[]
[]
[]
[]
[]
[]
[]
[]
[]
[]
[]
[]
[]
[]
[]
[]
[]
[]
[]
[]
[]
[]
[]
[]
[]
[]
[]
[]
[]
[]
[]
[]
[]
[]
[]
[]
[]
[]
[]
[]
[]
[]
[]
[]
[]
[]
[]
[]
[]
[]
[]
[]
[]
[]
[]
[]
[]
[]
[]
[]
[]
[]
[]
[]
[]
[]
[]
[]
[]
[]
[]
[]
[]
[]
[]
[]
[]
[]
[]
[]
[]
[]
[]
[]
[]
[]
[]
[]
[]
[]
[]
[]
[]
[]
[]
[]
[]
[]
[]
[]
[]
[]
[]
[]
[]
[]
[]
[]
[]
[]
[]
[]
[]
[]
[]
[]
[]
[]
[]
[]
[]
[]
[]
[]
[]
[]
[]
[]
[]
[]
[]
[]
[]
[]
[]
[]
[]
[]
[]
[]
[]
[]
[]
[]
[]
[]
[]
[]
[]
[]
[]
[]
[]
[]
[]
[]
[]
[]
[]
[]
[]
[]
[]
[]
[]
[]
[]
[]
[]
[]
[]
[]
[]
[]
[]
[]
[]
[]
[]
[]
[]
[]
[]
[]
[]
[]
[]
[]
[]
[]
[]
[]
[]
[]
[]
[]
[]
[]
[]
[]
[]
[]
[]
[]
[]
[]
[]
[]
[]
[]
[]
[]
[]
[]
[]
[]
[]
[]
[]
[]
[]
[]
[]
[]
[]
[]
[]
[]
[]
[]
[]
[]
[]
[]
[]
[]
[]
[]
[]
[]
[]
[]
[]
[]
[]
[]
[]
[]
[]
[]
[]
[]
[]
[]
[]
[]
[]
[]
[]
[]
[]
[]
[]
[]
[]
[]
[]
[]
[]
[]
[]
[]
[]
[]
[]
[]
[]
[]
[]
[]
[]
[]
[]
[]
[]
[]
[]
[]
[]
[]
[]
[]
[]
[]
[]
[]
[]
[]
[]
[]
[]
[]
[]
[]
[]
[]
[]
[]
[]
[]
[]
[]
[]
[]
[]
[]
[]
[]
[]
[]
[]
[]
[]
[]
[]
[]
[]
[]
[]
[]
[]
[]
[]
[]
[]
[]
[]
[]
[]
[]
[]
[]
[]
[]
[]
[]
[]
[]
[]
[]
[]
[]
[]
[]
[]
[]
[]
[]
[]
[]
[]
[]
[]
[]
[]
[]
[]
[]
[]
[]
[]
[]
[]
[]
[]
[]
[]
[]
[]
[]
[]
[]
[]
[]
[]
[]
[]
[]
[]
[]
[]
[]
[]
[]
[]
[]
[]
[]
[]
[]
[]
[]
[]
[]
[]
[]
[]
[]
[]
[]
[]
[]
[]
[]
[]
[]
[]
[]
[]
[]
[]
[]
[]
[]
[]
[]
[]
[]
[]
[]
[]
[]
[]
[]
[]
[]
[]
[]
[]
[]
[]
[]
[]
[]
[]
[]
[]
[]
[]
[]
[]
[]
[]
[]
[]
[]
[]
[]
[]
[]
[]
[]
[]
[]
[]
[]
[]
[]
[]
[]
[]
[]
[]
[]
[]
[]
[]
[]
[]
[]
[]
[]
[]
[]
[]
[]
[]
[]
[]
[]
[]
[]
[]
[]
[]
[]
[]
[]
[]
[]
[]
[]
[]
[]
[]
[]
[]
[]
[]
[]
[]
[]
[]
[]
[]
[]
[]
[]
[]
[]
[]
[]
[]
[]
[]
[]
[]
[]
[]
[]
[]
[]
[]
[]
[]
[]
[]
[]
[]
[]
[]
[]
[]
[]
[]
[]
[]
[]
[]
[]
[]
[]
[]
[]
[]
[]
[]
[]
[]
[]
[]
[]
[]
[]
[]
[]
[]
[]
[]
[]
[]
[]
[]
[]
[]
[]
[]
[]
[]
[]
[]
[]
[]
[]
[]
[]
[]
[]
[]
[]
[]
[]
[]
[]
[]
[]
[]
[]
[]
[]
[]
[]
[]
[]
[]
[]
[null,null,null,null,null,null,null,null,null,null,null,null,null,false]

{"sheet":"11월","index":3,"n_rows":4946,"n_cols":19,"rows_kept":4946,"cut":false,"hidden":false,"merged":[[5,13,5,14],[7,1,7,2],[7,3,7,4],[7,5,7,6],[7,7,7,8],[7,9,7,10],[7,11,7,12],[7,13,7,14],[0,5,0,14],[1,1,3,2],[1,5,3,14],[2,3,3,3],[5,1,5,2],[5,3,5,4],[5,5,5,6],[5,7,5,8],[5,9,5,10],[5,11,5,12],[8,13,8,14],[9,1,9,2],[9,3,9,4],[9,5,9,6],[9,7,9,8],[9,9,9,10],[9,11,9,12],[9,13,9,14],[8,1,8,2],[8,3,8,4],[8,5,8,6],[8,7,8,8],[8,9,8,10],[8,11,8,12],[10,13,10,14],[11,1,11,2],[11,3,11,4],[11,5,11,6],[11,7,11,8],[11,9,11,10],[11,11,11,12],[11,13,11,14],[10,1,10,2],[10,3,10,4],[10,5,10,6],[10,7,10,8],[10,9,10,10],[10,11,10,12],[13,13,13,14],[14,1,14,2],[14,3,14,4],[14,5,14,6],[14,7,14,8],[14,9,14,10],[14,11,14,12],[14,13,14,14],[13,1,13,2],[13,3,13,4],[13,5,13,6],[13,7,13,8],[13,9,13,10],[13,11,13,12],[15,13,15,14],[16,1,16,2],[16,3,16,4],[16,5,16,6],[16,7,16,8],[16,9,16,10],[16,11,16,12],[16,13,16,14],[15,1,15,2],[15,3,15,4],[15,5,15,6],[15,7,15,8],[15,9,15,10],[15,11,15,12],[17,13,17,14],[19,1,19,2],[19,3,19,4],[19,5,19,6],[19,7,19,8],[19,9,19,10],[19,11,19,12],[19,13,19,14],[17,1,17,2],[17,3,17,4],[17,5,17,6],[17,7,17,8],[17,9,17,10],[17,11,17,12],[20,13,20,14],[21,1,21,2],[21,3,21,4],[21,5,21,6],[21,7,21,8],[21,9,21,10],[21,11,21,12],[21,13,21,14],[20,1,20,2],[20,3,20,4],[20,5,20,6],[20,7,20,8],[20,9,20,10],[20,11,20,12],[22,13,22,14],[23,1,23,2],[23,3,23,4],[23,5,23,6],[23,7,23,8],[23,9,23,10],[23,11,23,12],[23,13,23,14],[22,1,22,2],[22,3,22,4],[22,5,22,6],[22,7,22,8],[22,9,22,10],[22,11,22,12],[25,13,25,14],[26,1,26,2],[26,3,26,4],[26,5,26,6],[26,7,26,8],[26,9,26,10],[26,11,26,12],[26,13,26,14],[25,1,25,2],[25,3,25,4],[25,5,25,6],[25,7,25,8],[25,9,25,10],[25,11,25,12],[27,13,27,14],[28,1,28,2],[28,3,28,4],[28,5,28,6],[28,7,28,8],[28,9,28,10],[28,11,28,12],[28,13,28,14],[27,1,27,2],[27,3,27,4],[27,5,27,6],[27,7,27,8],[27,9,27,10],[27,11,27,12],[29,13,29,14],[31,1,31,2],[31,3,31,4],[31,5,31,6],[31,7,31,8],[31,9,31,10],[31,11,31,12],[31,13,31,14],[29,1,29,2],[29,3,29,4],[29,5,29,6],[29,7,29,8],[29,9,29,10],[29,11,29,12],[32,13,32,14],[33,1,33,2],[33,3,33,4],[33,5,33,6],[33,7,33,8],[33,9,33,10],[33,11,33,12],[33,13,33,14],[32,1,32,2],[32,3,32,4],[32,5,32,6],[32,7,32,8],[32,9,32,10],[32,11,32,12],[37,13,37,14],[50,11,50,14],[37,1,37,2],[37,3,37,4],[37,5,37,6],[37,7,37,8],[37,9,37,10],[37,11,37,12],[34,13,34,14],[35,1,35,2],[35,3,35,4],[35,5,35,6],[35,7,35,8],[35,9,35,10],[35,11,35,12],[35,13,35,14],[34,1,34,2],[34,3,34,4],[34,5,34,6],[34,7,34,8],[34,9,34,10],[34,11,34,12]]}
[]
[null,11,null,2022,null,"불기 2566년   단기 4355년  서기 2022년"]
[null,null,null,{"$f":"TEXT(DATE(D2,B2,1),\"mmmm\")","v":"November"},null,null,null,null,null,null,null,null,null,null,null,null,null,null,"←클릭 전 주의해주세요!"]
[]
[]
[null,{"$f":"IF(연간!$B$2=\"S\",\"SUN\",IF(연간!$B$2=\"M\",\"MON\"))","v":"SUN"},null,{"$f":"IF(연간!$B$2=\"S\",\"MON\",IF(연간!$B$2=\"M\",\"TUE\"))","v":"MON"},null,{"$f":"IF(연간!$B$2=\"S\",\"TUE\",IF(연간!$B$2=\"M\",\"WED\"))","v":"TUE"},null,{"$f":"IF(연간!$B$2=\"S\",\"WED\",IF(연간!$B$2=\"M\",\"THU\"))","v":"WED"},null,{"$f":"IF(연간!$B$2=\"S\",\"THU\",IF(연간!$B$2=\"M\",\"FRI\"))","v":"THU"},null,{"$f":"IF(연간!$B$2=\"S\",\"FRI\",IF(연간!$B$2=\"M\",\"SAT\"))","v":"FRI"},null,{"$f":"IF(연간!$B$2=\"S\",\"SAT\",IF(연간!$B$2=\"M\",\"SUN\"))","v":"SAT"}]
[null,null,{"$f":"IF(연간!$B$2=\"M\",(IF(DAY(DATE($D$2,$B$2,1)-WEEKDAY(DATE($D$2,$B$2,1))+2)=2,DATE($D$2,$B$2,1)-WEEKDAY(DATE($D$2,$B$2,1))-5,DATE($D$2,$B$2,1)-WEEKDAY(DATE($D$2,$B$2,1))+2)),IF(연간!$B$2=\"S\",DATE($D$2,$B$2,1)-WEEKDAY(DATE($D$2,$B$2,1))+1))","v":"2022-10-30"},null,{"$f":"C7+1","v":"2022-10-31"},null,{"$f":"C7+2","v":"2022-11-01"},null,{"$f":"C7+3","v":"2022-11-02"},null,{"$f":"C7+4","v":"2022-11-03"},null,{"$f":"C7+5","v":"2022-11-04"},null,{"$f":"C7+6","v":"2022-11-05"},null,"개인일정"]
[null,{"$f":"TEXT(C7,\"[$-000E0000]m/d\")","v":"10/6"},null,{"$f":"TEXT(E7,\"[$-000E0000]m/d\")","v":"10/7"},null,{"$f":"TEXT(G7,\"[$-000E0000]m/d\")","v":"10/8"},null,{"$f":"TEXT(I7,\"[$-000E0000]m/d\")","v":"10/9"},null,{"$f":"TEXT(K7,\"[$-000E0000]m/d\")","v":"10/10"},null,{"$f":"TEXT(M7,\"[$-000E0000]m/d\")","v":"10/11"},null,{"$f":"TEXT(O7,\"[$-000E0000]m/d\")","v":"10/12"},null,null,"업무일정"]
[null,null,null,null,null,null,null,null,null,null,null,null,null,null,null,null,"중요일정"]
[null,null,null,null,null,null,null,null,null,null,null,null,null,null,null,null,"기념일"]
[]
[]
[null,null,{"$f":"C7+7","v":"2022-11-06"},null,{"$f":"C7+8","v":"2022-11-07"},null,{"$f":"C7+9","v":"2022-11-08"},null,{"$f":"C7+10","v":"2022-11-09"},null,{"$f":"C7+11","v":"2022-11-10"},null,{"$f":"C7+12","v":"2022-11-11"},null,{"$f":"C7+13","v":"2022-11-12"}]
[null,{"$f":"TEXT(C13,\"[$-000E0000]m/d\")","v":"10/13"},null,{"$f":"TEXT(E13,\"[$-000E0000]m/d\")","v":"10/14"},null,{"$f":"TEXT(G13,\"[$-000E0000]m/d\")","v":"10/15"},null,{"$f":"TEXT(I13,\"[$-000E0000]m/d\")","v":"10/16"},null,{"$f":"TEXT(K13,\"[$-000E0000]m/d\")","v":"10/17"},null,{"$f":"TEXT(M13,\"[$-000E0000]m/d\")","v":"10/18"},null,{"$f":"TEXT(O13,\"[$-000E0000]m/d\")","v":"10/19"}]
[]
[]
[]
[]
[null,null,{"$f":"C7+14","v":"2022-11-13"},null,{"$f":"C7+15","v":"2022-11-14"},null,{"$f":"C7+16","v":"2022-11-15"},null,{"$f":"C7+17","v":"2022-11-16"},null,{"$f":"C7+18","v":"2022-11-17"},null,{"$f":"C7+19","v":"2022-11-18"},null,{"$f":"C7+20","v":"2022-11-19"}]
[null,{"$f":"TEXT(C19,\"[$-000E0000]m/d\")","v":"10/20"},null,{"$f":"TEXT(E19,\"[$-000E0000]m/d\")","v":"10/21"},null,{"$f":"TEXT(G19,\"[$-000E0000]m/d\")","v":"10/22"},null,{"$f":"TEXT(I19,\"[$-000E0000]m/d\")","v":"10/23"},null,{"$f":"TEXT(K19,\"[$-000E0000]m/d\")","v":"10/24"},null,{"$f":"TEXT(M19,\"[$-000E0000]m/d\")","v":"10/25"},null,{"$f":"TEXT(O19,\"[$-000E0000]m/d\")","v":"10/26"}]
[]
[]
[]
[]
[null,null,{"$f":"C7+21","v":"2022-11-20"},null,{"$f":"C7+22","v":"2022-11-21"},null,{"$f":"C7+23","v":"2022-11-22"},null,{"$f":"C7+24","v":"2022-11-23"},null,{"$f":"C7+25","v":"2022-11-24"},null,{"$f":"C7+26","v":"2022-11-25"},null,{"$f":"C7+27","v":"2022-11-26"}]
[null,{"$f":"TEXT(C25,\"[$-000E0000]m/d\")","v":"10/27"},null,{"$f":"TEXT(E25,\"[$-000E0000]m/d\")","v":"10/28"},null,{"$f":"TEXT(G25,\"[$-000E0000]m/d\")","v":"10/29"},null,{"$f":"TEXT(I25,\"[$-000E0000]m/d\")","v":"10/30"},null,{"$f":"TEXT(K25,\"[$-000E0000]m/d\")","v":"11/1"},null,{"$f":"TEXT(M25,\"[$-000E0000]m/d\")","v":"11/2"},null,{"$f":"TEXT(O25,\"[$-000E0000]m/d\")","v":"11/3"}]
[]
[]
[]
[]
[null,null,{"$f":"C13+21","v":"2022-11-27"},null,{"$f":"C13+22","v":"2022-11-28"},null,{"$f":"C13+23","v":"2022-11-29"},null,{"$f":"C13+24","v":"2022-11-30"},null,{"$f":"C13+25","v":"2022-12-01"},null,{"$f":"C13+26","v":"2022-12-02"},null,{"$f":"C13+27","v":"2022-12-03"}]
[null,{"$f":"TEXT(C31,\"[$-000E0000]m/d\")","v":"11/4"},null,{"$f":"TEXT(E31,\"[$-000E0000]m/d\")","v":"11/5"},null,{"$f":"TEXT(G31,\"[$-000E0000]m/d\")","v":"11/6"},null,{"$f":"TEXT(I31,\"[$-000E0000]m/d\")","v":"11/7"},null,{"$f":"TEXT(K31,\"[$-000E0000]m/d\")","v":"11/8"},null,{"$f":"TEXT(M31,\"[$-000E0000]m/d\")","v":"11/9"},null,{"$f":"TEXT(O31,\"[$-000E0000]m/d\")","v":"11/10"}]
[]
[]
[]
[]
[null,null,{"$f":"C13+28","v":"2022-12-04"},null,{"$f":"C13+29","v":"2022-12-05"},null,{"$f":"C13+30","v":"2022-12-06"},null,{"$f":"C13+31","v":"2022-12-07"},null,{"$f":"C13+32","v":"2022-12-08"},null,{"$f":"C13+33","v":"2022-12-09"},null,{"$f":"C13+34","v":"2022-12-10"}]
[null,{"$f":"TEXT(C37,\"[$-000E0000]m/d\")","v":"11/11"},null,{"$f":"TEXT(E37,\"[$-000E0000]m/d\")","v":"11/12"},null,{"$f":"TEXT(G37,\"[$-000E0000]m/d\")","v":"11/13"},null,{"$f":"TEXT(I37,\"[$-000E0000]m/d\")","v":"11/14"},null,{"$f":"TEXT(K37,\"[$-000E0000]m/d\")","v":"11/15"},null,{"$f":"TEXT(M37,\"[$-000E0000]m/d\")","v":"11/16"},null,{"$f":"TEXT(O37,\"[$-000E0000]m/d\")","v":"11/17"}]
[]
[]
[]
[]
[1,null,null,null,null,false,null,null,null,null,null,null,null,false]
[2,false,null,false,null,false,null,false,null,false,null,false,null,false]
[3,false,null,false,null,false,null,false,null,false,null,false,null,false]
[4,false,null,false,null,false,null,false,null,false,null,false,null,false]
[5,false,null,false,null,false,null,false,null,false,null,false,null,false]
[6,false,null,false,null,false,null,false,null,false,null,false,null,false]
[]
[]
[]
[]
[]
[]
[]
[]
[]
[]
[]
[]
[]
[]
[]
[]
[]
[]
[]
[]
[]
[]
[]
[]
[]
[]
[]
[]
[]
[]
[]
[]
[]
[]
[]
[]
[]
[]
[]
[]
[]
[]
[]
[]
[]
[]
[]
[]
[]
[]
[]
[]
[]
[]
[]
[]
[]
[]
[]
[]
[]
[]
[]
[]
[]
[]
[]
[]
[]
[]
[]
[]
[]
[]
[]
[]
[]
[]
[]
[]
[]
[]
[]
[]
[]
[]
[]
[]
[]
[]
[]
[]
[]
[]
[]
[]
[]
[]
[]
[]
[]
[]
[]
[]
[]
[]
[]
[]
[]
[]
[]
[]
[]
[]
[]
[]
[]
[]
[]
[]
[]
[]
[]
[]
[]
[]
[]
[]
[]
[]
[]
[]
[]
[]
[]
[]
[]
[]
[]
[]
[]
[]
[]
[]
[]
[]
[]
[]
[]
[]
[]
[]
[]
[]
[]
[]
[]
[]
[]
[]
[]
[]
[]
[]
[]
[]
[]
[]
[]
[]
[]
[]
[]
[]
[]
[]
[]
[]
[]
[]
[]
[]
[]
[]
[]
[]
[]
[]
[]
[]
[]
[]
[]
[]
[]
[]
[]
[]
[]
[]
[]
[]
[]
[]
[]
[]
[]
[]
[]
[]
[]
[]
[]
[]
[]
[]
[]
[]
[]
[]
[]
[]
[]
[]
[]
[]
[]
[]
[]
[]
[]
[]
[]
[]
[]
[]
[]
[]
[]
[]
[]
[]
[]
[]
[]
[]
[]
[]
[]
[]
[]
[]
[]
[]
[]
[]
[]
[]
[]
[]
[]
[]
[]
[]
[]
[]
[]
[]
[]
[]
[]
[]
[]
[]
[]
[]
[]
[]
[]
[]
[]
[]
[]
[]
[]
[]
[]
[]
[]
[]
[]
[]
[]
[]
[]
[]
[]
[]
[]
[]
[]
[]
[]
[]
[]
[]
[]
[]
[]
[]
[]
[]
[]
[]
[]
[]
[]
[]
[]
[]
[]
[]
[]
[]
[]
[]
[]
[]
[]
[]
[]
[]
[]
[]
[]
[]
[]
[]
[]
[]
[]
[]
[]
[]
[]
[]
[]
[]
[]
[]
[]
[]
[]
[]
[]
[]
[]
[]
[]
[]
[]
[]
[]
[]
[]
[]
[]
[]
[]
[]
[]
[]
[]
[]
[]
[]
[]
[]
[]
[]
[]
[]
[]
[]
[]
[]
[]
[]
[]
[]
[]
[]
[]
[]
[]
[]
[]
[]
[]
[]
[]
[]
[]
[]
[]
[]
[]
[]
[]
[]
[]
[]
[]
[]
[]
[]
[]
[]
[]
[]
[]
[]
[]
[]
[]
[]
[]
[]
[]
[]
[]
[]
[]
[]
[]
[]
[]
[]
[]
[]
[]
[]
[]
[]
[]
[]
[]
[]
[]
[]
[]
[]
[]
[]
[]
[]
[]
[]
[]
[]
[]
[]
[]
[]
[]
[]
[]
[]
[]
[]
[]
[]
[]
[]
[]
[]
[]
[]
[]
[]
[]
[]
[]
[]
[]
[]
[]
[]
[]
[]
[]
[]
[]
[]
[]
[]
[]
[]
[]
[]
[]
[]
[]
[]
[]
[]
[]
[]
[]
[]
[]
[]
[]
[]
[]
[]
[]
[]
[]
[]
[]
[]
[]
[]
[]
[]
[]
[]
[]
[]
[]
[]
[]
[]
[]
[]
[]
[]
[]
[]
[]
[]
[]
[]
[]
[]
[]
[]
[]
[]
[]
[]
[]
[]
[]
[]
[]
[]
[]
[]
[]
[]
[]
[]
[]
[]
[]
[]
[]
[]
[]
[]
[]
[]
[]
[]
[]
[]
[]
[]
[]
[]
[]
[]
[]
[]
[]
[]
[]
[]
[]
[]
[]
[]
[]
[]
[]
[]
[]
[]
[]
[]
[]
[]
[]
[]
[]
[]
[]
[]
[]
[]
[]
[]
[]
[]
[]
[]
[]
[]
[]
[]
[]
[]
[]
[]
[]
[]
[]
[]
[]
[]
[]
[]
[]
[]
[]
[]
[]
[]
[]
[]
[]
[]
[]
[]
[]
[]
[]
[]
[]
[]
[]
[]
[]
[]
[]
[]
[]
[]
[]
[]
[]
[]
[]
[]
[]
[]
[]
[]
[]
[]
[]
[]
[]
[]
[]
[]
[]
[]
[]
[]
[]
[]
[]
[]
[]
[]
[]
[]
[]
[]
[]
[]
[]
[]
[]
[]
[]
[]
[]
[]
[]
[]
[]
[]
[]
[]
[]
[]
[]
[]
[]
[]
[]
[]
[]
[]
[]
[]
[]
[]
[]
[]
[]
[]
[]
[]
[]
[]
[]
[]
[]
[]
[]
[]
[]
[]
[]
[]
[]
[]
[]
[]
[]
[]
[]
[]
[]
[]
[]
[]
[]
[]
[]
[]
[]
[]
[]
[]
[]
[]
[]
[]
[]
[]
[]
[]
[]
[]
[]
[]
[]
[]
[]
[]
[]
[]
[]
[]
[]
[]
[]
[]
[]
[]
[]
[]
[]
[]
[]
[]
[]
[]
[]
[]
[]
[]
[]
[]
[]
[]
[]
[]
[]
[]
[]
[]
[]
[]
[]
[]
[]
[]
[]
[]
[]
[]
[]
[]
[]
[]
[]
[]
[]
[]
[]
[]
[]
[]
[]
[]
[]
[]
[]
[]
[]
[]
[]
[]
[]
[]
[]
[]
[]
[]
[]
[]
[]
[]
[]
[]
[]
[]
[]
[]
[]
[]
[]
[]
[]
[]
[]
[]
[]
[]
[]
[]
[]
[]
[]
[]
[]
[]
[]
[]
[]
[]
[]
[]
[]
[]
[]
[]
[]
[]
[]
[]
[]
[]
[]
[]
[]
[]
[]
[]
[]
[]
[]
[]
[]
[]
[]
[]
[]
[]
[]
[]
[]
[]
[]
[]
[]
[]
[]
[]
[]
[]
[]
[]
[]
[]
[]
[]
[]
[]
[]
[]
[]
[]
[]
[]
[]
[]
[]
[]
[]
[]
[]
[]
[]
[]
[]
[]
[]
[]
[]
[]
[]
[]
[]
[]
[]
[]
[]
[]
[]
[]
[]
[]
[]
[]
[]
[]
[]
[]
[]
[]
[]
[]
[]
[]
[]
[]
[]
[]
[]
[]
[]
[]
[]
[]
[]
[]
[]
[]
[]
[]
[]
[]
[]
[]
[]
[]
[]
[]
[]
[]
[]
[]
[]
[]
[]
[]
[]
[]
[]
[]
[]
[]
[]
[]
[]
[]
[]
[]
[]
[]
[]
[]
[]
[]
[]
[]
[]
[]
[]
[]
[]
[]
[]
[]
[]
[]
[]
[]
[]
[]
[]
[]
[]
[]
[]
[]
[]
[]
[]
[]
[]
[]
[]
[]
[]
[]
[]
[]
[]
[]
[]
[]
[]
[]
[]
[]
[]
[]
[]
[]
[]
[]
[]
[]
[]
[]
[]
[]
[]
[]
[]
[]
[]
[]
[]
[]
[]
[]
[]
[]
[]
[]
[]
[]
[]
[]
[]
[]
[]
[]
[]
[]
[]
[]
[]
[]
[]
[]
[]
[]
[]
[]
[]
[]
[]
[]
[]
[]
[]
[]
[]
[]
[]
[]
[]
[]
[]
[]
[]
[]
[]
[]
[]
[]
[]
[]
[]
[]
[]
[]
[]
[]
[]
[]
[]
[]
[]
[]
[]
[]
[]
[]
[]
[]
[]
[]
[]
[]
[]
[]
[]
[]
[]
[]
[]
[]
[]
[]
[]
[]
[]
[]
[]
[]
[]
[]
[]
[]
[]
[]
[]
[]
[]
[]
[]
[]
[]
[]
[]
[]
[]
[]
[]
[]
[]
[]
[]
[]
[]
[]
[]
[]
[]
[]
[]
[]
[]
[]
[]
[]
[]
[]
[]
[]
[]
[]
[]
[]
[]
[]
[]
[]
[]
[]
[]
[]
[]
[]
[]
[]
[]
[]
[]
[]
[]
[]
[]
[]
[]
[]
[]
[]
[]
[]
[]
[]
[]
[]
[]
[]
[]
[]
[]
[]
[]
[]
[]
[]
[]
[]
[]
[]
[]
[]
[]
[]
[]
[]
[]
[]
[]
[]
[]
[]
[]
[]
[]
[]
[]
[]
[]
[]
[]
[]
[]
[]
[]
[]
[]
[]
[]
[]
[]
[]
[]
[]
[]
[]
[]
[]
[]
[]
[]
[]
[]
[]
[]
[]
[]
[]
[]
[]
[]
[]
[]
[]
[]
[]
[]
[]
[]
[]
[]
[]
[]
[]
[]
[]
[]
[]
[]
[]
[]
[]
[]
[]
[]
[]
[]
[]
[]
[]
[]
[]
[]
[]
[]
[]
[]
[]
[]
[]
[]
[]
[]
[]
[]
[]
[]
[]
[]
[]
[]
[]
[]
[]
[]
[]
[]
[]
[]
[]
[]
[]
[]
[]
[]
[]
[]
[]
[]
[]
[]
[]
[]
[]
[]
[]
[]
[]
[]
[]
[]
[]
[]
[]
[]
[]
[]
[]
[]
[]
[]
[]
[]
[]
[]
[]
[]
[]
[]
[]
[]
[]
[]
[]
[]
[]
[]
[]
[]
[]
[]
[]
[]
[]
[]
[]
[]
[]
[]
[]
[]
[]
[]
[]
[]
[]
[]
[]
[]
[]
[]
[]
[]
[]
[]
[]
[]
[]
[]
[]
[]
[]
[]
[]
[]
[]
[]
[]
[]
[]
[]
[]
[]
[]
[]
[]
[]
[]
[]
[]
[]
[]
[]
[]
[]
[]
[]
[]
[]
[]
[]
[]
[]
[]
[]
[]
[]
[]
[]
[]
[]
[]
[]
[]
[]
[]
[]
[]
[]
[]
[]
[]
[]
[]
[]
[]
[]
[]
[]
[]
[]
[]
[]
[]
[]
[]
[]
[]
[]
[]
[]
[]
[]
[]
[]
[]
[]
[]
[]
[]
[]
[]
[]
[]
[]
[]
[]
[]
[]
[]
[]
[]
[]
[]
[]
[]
[]
[]
[]
[]
[]
[]
[]
[]
[]
[]
[]
[]
[]
[]
[]
[]
[]
[]
[]
[]
[]
[]
[]
[]
[]
[]
[]
[]
[]
[]
[]
[]
[]
[]
[]
[]
[]
[]
[]
[]
[]
[]
[]
[]
[]
[]
[]
[]
[]
[]
[]
[]
[]
[]
[]
[]
[]
[]
[]
[]
[]
[]
[]
[]
[]
[]
[]
[]
[]
[]
[]
[]
[]
[]
[]
[]
[]
[]
[]
[]
[]
[]
[]
[]
[]
[]
[]
[]
[]
[]
[]
[]
[]
[]
[]
[]
[]
[]
[]
[]
[]
[]
[]
[]
[]
[]
[]
[]
[]
[]
[]
[]
[]
[]
[]
[]
[]
[]
[]
[]
[]
[]
[]
[]
[]
[]
[]
[]
[]
[]
[]
[]
[]
[]
[]
[]
[]
[]
[]
[]
[]
[]
[]
[]
[]
[]
[]
[]
[]
[]
[]
[]
[]
[]
[]
[]
[]
[]
[]
[]
[]
[]
[]
[]
[]
[]
[]
[]
[]
[]
[]
[]
[]
[]
[]
[]
[]
[]
[]
[]
[]
[]
[]
[]
[]
[]
[]
[]
[]
[]
[]
[]
[]
[]
[]
[]
[]
[]
[]
[]
[]
[]
[]
[]
[]
[]
[]
[]
[]
[]
[]
[]
[]
[]
[]
[]
[]
[]
[]
[]
[]
[]
[]
[]
[]
[]
[]
[]
[]
[]
[]
[]
[]
[]
[]
[]
[]
[]
[]
[]
[]
[]
[]
[]
[]
[]
[]
[]
[]
[]
[]
[]
[]
[]
[]
[]
[]
[]
[]
[]
[]
[]
[]
[]
[]
[]
[]
[]
[]
[]
[]
[]
[]
[]
[]
[]
[]
[]
[]
[]
[]
[]
[]
[]
[]
[]
[]
[]
[]
[]
[]
[]
[]
[]
[]
[]
[]
[]
[]
[]
[]
[]
[]
[]
[]
[]
[]
[]
[]
[]
[]
[]
[]
[]
[]
[]
[]
[]
[]
[]
[]
[]
[]
[]
[]
[]
[]
[]
[]
[]
[]
[]
[]
[]
[]
[]
[]
[]
[]
[]
[]
[]
[]
[]
[]
[]
[]
[]
[]
[]
[]
[]
[]
[]
[]
[]
[]
[]
[]
[]
[]
[]
[]
[]
[]
[]
[]
[]
[]
[]
[]
[]
[]
[]
[]
[]
[]
[]
[]
[]
[]
[]
[]
[]
[]
[]
[]
[]
[]
[]
[]
[]
[]
[]
[]
[]
[]
[]
[]
[]
[]
[]
[]
[]
[]
[]
[]
[]
[]
[]
[]
[]
[]
[]
[]
[]
[]
[]
[]
[]
[]
[]
[]
[]
[]
[]
[]
[]
[]
[]
[]
[]
[]
[]
[]
[]
[]
[]
[]
[]
[]
[]
[]
[]
[]
[]
[]
[]
[]
[]
[]
[]
[]
[]
[]
[]
[]
[]
[]
[]
[]
[]
[]
[]
[]
[]
[]
[]
[]
[]
[]
[]
[]
[]
[]
[]
[]
[]
[]
[]
[]
[]
[]
[]
[]
[]
[]
[]
[]
[]
[]
[]
[]
[]
[]
[]
[]
[]
[]
[]
[]
[]
[]
[]
[]
[]
[]
[]
[]
[]
[]
[]
[]
[]
[]
[]
[]
[]
[]
[]
[]
[]
[]
[]
[]
[]
[]
[]
[]
[]
[]
[]
[]
[]
[]
[]
[]
[]
[]
[]
[]
[]
[]
[]
[]
[]
[]
[]
[]
[]
[]
[]
[]
[]
[]
[]
[]
[]
[]
[]
[]
[]
[]
[]
[]
[]
[]
[]
[]
[]
[]
[]
[]
[]
[]
[]
[]
[]
[]
[]
[]
[]
[]
[]
[]
[]
[]
[]
[]
[]
[]
[]
[]
[]
[]
[]
[]
[]
[]
[]
[]
[]
[]
[]
[]
[]
[]
[]
[]
[]
[]
[]
[]
[]
[]
[]
[]
[]
[]
[]
[]
[]
[]
[]
[]
[]
[]
[]
[]
[]
[]
[]
[]
[]
[]
[]
[]
[]
[]
[]
[]
[]
[]
[]
[]
[]
[]
[]
[]
[]
[]
[]
[]
[]
[]
[]
[]
[]
[]
[]
[]
[]
[]
[]
[]
[]
[]
[]
[]
[]
[]
[]
[]
[]
[]
[]
[]
[]
[]
[]
[]
[]
[]
[]
[]
[]
[]
[]
[]
[]
[]
[]
[]
[]
[]
[]
[]
[]
[]
[]
[]
[]
[]
[]
[]
[]
[]
[]
[]
[]
[]
[]
[]
[]
[]
[]
[]
[]
[]
[]
[]
[]
[]
[]
[]
[]
[]
[]
[]
[]
[]
[]
[]
[]
[]
[]
[]
[]
[]
[]
[]
[]
[]
[]
[]
[]
[]
[]
[]
[]
[]
[]
[]
[]
[]
[]
[]
[]
[]
[]
[]
[]
[]
[]
[]
[]
[]
[]
[]
[]
[]
[]
[]
[]
[]
[]
[]
[]
[]
[]
[]
[]
[]
[]
[]
[]
[]
[]
[]
[]
[]
[]
[]
[]
[]
[]
[]
[]
[]
[]
[]
[]
[]
[]
[]
[]
[]
[]
[]
[]
[]
[]
[]
[]
[]
[]
[]
[]
[]
[]
[]
[]
[]
[]
[]
[]
[]
[]
[]
[]
[]
[]
[]
[]
[]
[]
[]
[]
[]
[]
[]
[]
[]
[]
[]
[]
[]
[]
[]
[]
[]
[]
[]
[]
[]
[]
[]
[]
[]
[]
[]
[]
[]
[]
[]
[]
[]
[]
[]
[]
[]
[]
[]
[]
[]
[]
[]
[]
[]
[]
[]
[]
[]
[]
[]
[]
[]
[]
[]
[]
[]
[]
[]
[]
[]
[]
[]
[]
[]
[]
[]
[]
[]
[]
[]
[]
[]
[]
[]
[]
[]
[]
[]
[]
[]
[]
[]
[]
[]
[]
[]
[]
[]
[]
[]
[]
[]
[]
[]
[]
[]
[]
[]
[]
[]
[]
[]
[]
[]
[]
[]
[]
[]
[]
[]
[]
[]
[]
[]
[]
[]
[]
[]
[]
[]
[]
[]
[]
[]
[]
[]
[]
[]
[]
[]
[]
[]
[]
[]
[]
[]
[]
[]
[]
[]
[]
[]
[]
[]
[]
[]
[]
[]
[]
[]
[]
[]
[]
[]
[]
[]
[]
[]
[]
[]
[]
[]
[]
[]
[]
[]
[]
[]
[]
[]
[]
[]
[]
[]
[]
[]
[]
[]
[]
[]
[]
[]
[]
[]
[]
[]
[]
[]
[]
[]
[]
[]
[]
[]
[]
[]
[]
[]
[]
[]
[]
[]
[]
[]
[]
[]
[]
[]
[]
[]
[]
[]
[]
[]
[]
[]
[]
[]
[]
[]
[]
[]
[]
[]
[]
[]
[]
[]
[]
[]
[]
[]
[]
[]
[]
[]
[]
[]
[]
[]
[]
[]
[]
[]
[]
[]
[]
[]
[]
[]
[]
[]
[]
[]
[]
[]
[]
[]
[]
[]
[]
[]
[]
[]
[]
[]
[]
[]
[]
[]
[]
[]
[]
[]
[]
[]
[]
[]
[]
[]
[]
[]
[]
[]
[]
[]
[]
[]
[]
[]
[]
[]
[]
[]
[]
[]
[]
[]
[]
[]
[]
[]
[]
[]
[]
[]
[]
[]
[]
[]
[]
[]
[]
[]
[]
[]
[]
[]
[]
[]
[]
[]
[]
[]
[]
[]
[]
[]
[]
[]
[]
[]
[]
[]
[]
[]
[]
[]
[]
[]
[]
[]
[]
[]
[]
[]
[]
[]
[]
[]
[]
[]
[]
[]
[]
[]
[]
[]
[]
[]
[]
[]
[]
[]
[]
[]
[]
[]
[]
[]
[]
[]
[]
[]
[]
[]
[]
[]
[]
[]
[]
[]
[]
[]
[]
[]
[]
[]
[]
[]
[]
[]
[]
[]
[]
[]
[]
[]
[]
[]
[]
[]
[]
[]
[]
[]
[]
[]
[]
[]
[]
[]
[]
[]
[]
[]
[]
[]
[]
[]
[]
[]
[]
[]
[]
[]
[]
[]
[]
[]
[]
[]
[]
[]
[]
[]
[]
[]
[]
[]
[]
[]
[]
[]
[]
[]
[]
[]
[]
[]
[]
[]
[]
[]
[]
[]
[]
[]
[]
[]
[]
[]
[]
[]
[]
[]
[]
[]
[]
[]
[]
[]
[]
[]
[]
[]
[]
[]
[]
[]
[]
[]
[]
[]
[]
[]
[]
[]
[]
[]
[]
[]
[]
[]
[]
[]
[]
[]
[]
[]
[]
[]
[]
[]
[]
[]
[]
[]
[]
[]
[]
[]
[]
[]
[]
[]
[]
[]
[]
[]
[]
[]
[]
[]
[]
[]
[]
[]
[]
[]
[]
[]
[]
[]
[]
[]
[]
[]
[]
[]
[]
[]
[]
[]
[]
[]
[]
[]
[]
[]
[]
[]
[]
[]
[]
[]
[]
[]
[]
[]
[]
[]
[]
[]
[]
[]
[]
[]
[]
[]
[]
[]
[]
[]
[]
[]
[]
[]
[]
[]
[]
[]
[]
[]
[]
[]
[]
[]
[]
[]
[]
[]
[]
[]
[]
[]
[]
[]
[]
[]
[]
[]
[]
[]
[]
[]
[]
[]
[]
[]
[]
[]
[]
[]
[]
[]
[]
[]
[]
[]
[]
[]
[]
[]
[]
[]
[]
[]
[]
[]
[]
[]
[]
[]
[]
[]
[]
[]
[]
[]
[]
[]
[]
[]
[]
[]
[]
[]
[]
[]
[]
[]
[]
[]
[]
[]
[]
[]
[]
[]
[]
[]
[]
[]
[]
[]
[]
[]
[]
[]
[]
[]
[]
[]
[]
[]
[]
[]
[]
[]
[]
[]
[]
[]
[]
[]
[]
[]
[]
[]
[]
[]
[]
[]
[]
[]
[]
[]
[]
[]
[]
[]
[]
[]
[]
[]
[]
[]
[]
[]
[]
[]
[]
[]
[]
[]
[]
[]
[]
[]
[]
[]
[]
[]
[]
[]
[]
[]
[]
[]
[]
[]
[]
[]
[]
[]
[]
[]
[]
[]
[]
[]
[]
[]
[]
[]
[]
[]
[]
[]
[]
[]
[]
[]
[]
[]
[]
[]
[]
[]
[]
[]
[]
[]
[]
[]
[]
[]
[]
[]
[]
[]
[]
[]
[]
[]
[]
[]
[]
[]
[]
[]
[]
[]
[]
[]
[]
[]
[]
[]
[]
[]
[]
[]
[]
[]
[]
[]
[]
[]
[]
[]
[]
[]
[]
[]
[]
[]
[]
[]
[]
[]
[]
[]
[]
[]
[]
[]
[]
[]
[]
[]
[]
[]
[]
[]
[]
[]
[]
[]
[]
[]
[]
[]
[]
[]
[]
[]
[]
[]
[]
[]
[]
[]
[]
[]
[]
[]
[]
[]
[]
[]
[]
[]
[]
[]
[]
[]
[]
[]
[]
[]
[]
[]
[]
[]
[]
[]
[]
[]
[]
[]
[]
[]
[]
[]
[]
[]
[]
[]
[]
[]
[]
[]
[]
[]
[]
[]
[]
[]
[]
[]
[]
[]
[]
[]
[]
[]
[]
[]
[]
[]
[]
[]
[]
[]
[]
[]
[]
[]
[]
[]
[]
[]
[]
[]
[]
[]
[]
[]
[]
[]
[]
[]
[]
[]
[]
[]
[]
[]
[]
[]
[]
[]
[]
[]
[]
[]
[]
[]
[]
[]
[]
[]
[]
[]
[]
[]
[]
[]
[]
[]
[]
[]
[]
[]
[]
[]
[]
[]
[]
[]
[]
[]
[]
[]
[]
[]
[]
[]
[]
[]
[]
[]
[]
[]
[]
[]
[]
[]
[]
[]
[]
[]
[]
[]
[]
[]
[]
[]
[]
[]
[]
[]
[]
[]
[]
[]
[]
[]
[]
[]
[]
[]
[]
[]
[]
[]
[]
[]
[]
[]
[]
[]
[]
[]
[]
[]
[]
[]
[]
[]
[]
[]
[]
[]
[]
[]
[]
[]
[]
[]
[]
[]
[]
[]
[]
[]
[]
[]
[]
[]
[]
[]
[]
[]
[]
[]
[]
[]
[]
[]
[]
[]
[]
[]
[]
[]
[]
[]
[]
[]
[]
[]
[]
[]
[]
[]
[]
[]
[]
[]
[]
[]
[]
[]
[]
[]
[]
[]
[]
[]
[]
[]
[]
[]
[]
[]
[]
[]
[]
[]
[]
[]
[]
[]
[]
[]
[]
[]
[]
[]
[]
[]
[]
[]
[]
[]
[]
[]
[]
[]
[]
[]
[]
[]
[]
[]
[]
[]
[]
[]
[]
[]
[]
[]
[]
[]
[]
[]
[]
[]
[]
[]
[]
[]
[]
[]
[]
[]
[]
[]
[]
[]
[]
[]
[]
[]
[]
[]
[]
[]
[]
[]
[]
[]
[]
[]
[]
[]
[]
[]
[]
[]
[]
[]
[]
[]
[]
[]
[]
[]
[]
[]
[]
[]
[]
[]
[]
[]
[]
[]
[]
[]
[]
[]
[]
[]
[]
[]
[]
[]
[]
[]
[]
[]
[]
[]
[]
[]
[]
[]
[]
[]
[]
[]
[]
[]
[]
[]
[]
[]
[]
[]
[]
[]
[]
[]
[]
[]
[]
[]
[]
[]
[]
[]
[]
[]
[]
[]
[]
[]
[]
[]
[]
[]
[]
[]
[]
[]
[]
[]
[]
[]
[]
[]
[]
[]
[]
[]
[]
[]
[]
[]
[]
[]
[]
[]
[]
[]
[]
[]
[]
[]
[]
[]
[]
[]
[]
[]
[]
[]
[]
[]
[]
[]
[]
[]
[]
[]
[]
[]
[]
[]
[]
[]
[]
[]
[]
[]
[]
[]
[]
[]
[]
[]
[]
[]
[]
[]
[]
[]
[]
[]
[]
[]
[]
[]
[]
[]
[]
[]
[]
[]
[]
[]
[]
[]
[]
[]
[]
[]
[]
[]
[]
[]
[]
[]
[]
[]
[]
[]
[]
[]
[]
[]
[]
[]
[]
[]
[]
[]
[]
[]
[]
[]
[]
[]
[]
[]
[]
[]
[]
[]
[]
[]
[]
[]
[]
[]
[]
[]
[]
[]
[]
[]
[]
[]
[]
[]
[]
[]
[]
[]
[]
[]
[]
[]
[]
[]
[]
[]
[]
[]
[]
[]
[]
[]
[]
[]
[]
[]
[]
[]
[]
[]
[]
[]
[]
[]
[]
[]
[]
[]
[]
[]
[]
[]
[]
[]
[]
[]
[]
[]
[]
[]
[]
[]
[]
[]
[]
[]
[]
[]
[]
[]
[]
[]
[]
[]
[]
[]
[]
[]
[]
[]
[]
[]
[]
[]
[]
[]
[]
[]
[]
[]
[]
[]
[]
[]
[]
[]
[]
[]
[]
[]
[]
[]
[]
[]
[]
[]
[]
[]
[]
[]
[]
[]
[]
[]
[]
[]
[]
[]
[]
[]
[]
[]
[]
[]
[]
[]
[]
[]
[]
[]
[]
[]
[]
[]
[]
[]
[]
[]
[]
[]
[]
[]
[]
[]
[]
[]
[]
[]
[]
[]
[]
[]
[]
[]
[]
[]
[]
[]
[]
[]
[]
[]
[]
[]
[]
[]
[]
[]
[]
[]
[]
[]
[]
[]
[]
[]
[]
[]
[]
[]
[]
[]
[]
[]
[]
[]
[]
[]
[]
[]
[]
[]
[]
[]
[]
[]
[]
[]
[]
[]
[]
[]
[]
[]
[]
[]
[]
[]
[]
[]
[]
[]
[]
[]
[]
[]
[]
[]
[]
[]
[]
[]
[]
[]
[]
[]
[]
[]
[]
[]
[]
[]
[]
[]
[]
[]
[]
[]
[]
[]
[]
[]
[]
[]
[]
[]
[]
[]
[]
[]
[]
[]
[]
[]
[]
[]
[]
[]
[]
[]
[]
[]
[]
[]
[]
[]
[]
[]
[]
[]
[]
[]
[]
[]
[]
[]
[]
[]
[]
[]
[]
[]
[]
[]
[]
[]
[]
[]
[]
[]
[]
[]
[]
[]
[]
[]
[]
[]
[]
[]
[]
[]
[]
[]
[]
[]
[]
[]
[]
[]
[]
[]
[]
[]
[]
[]
[]
[]
[]
[]
[]
[]
[]
[]
[]
[]
[]
[]
[]
[]
[]
[]
[]
[]
[]
[]
[]
[]
[]
[]
[]
[]
[]
[]
[]
[]
[]
[]
[]
[]
[]
[]
[]
[]
[]
[]
[]
[]
[]
[]
[]
[]
[]
[]
[]
[]
[]
[]
[]
[]
[]
[]
[]
[]
[]
[]
[]
[]
[]
[]
[]
[]
[]
[]
[]
[]
[]
[]
[]
[]
[]
[]
[]
[]
[]
[]
[]
[]
[]
[]
[]
[]
[]
[]
[]
[]
[]
[]
[]
[]
[]
[]
[]
[]
[]
[]
[]
[]
[]
[]
[]
[]
[]
[]
[]
[]
[]
[]
[]
[]
[]
[]
[]
[]
[]
[]
[]
[]
[]
[]
[]
[]
[]
[]
[]
[]
[]
[]
[]
[]
[]
[]
[]
[]
[]
[]
[]
[]
[]
[]
[]
[]
[]
[]
[]
[]
[]
[]
[]
[]
[]
[]
[]
[]
[]
[]
[]
[]
[]
[]
[]
[]
[]
[]
[]
[]
[]
[]
[]
[]
[]
[]
[]
[]
[]
[]
[]
[]
[]
[]
[]
[]
[]
[]
[]
[]
[]
[]
[]
[]
[]
[]
[]
[]
[]
[]
[]
[]
[]
[]
[]
[]
[]
[]
[]
[]
[]
[]
[]
[]
[]
[]
[]
[]
[]
[]
[]
[]
[]
[]
[]
[]
[]
[]
[]
[]
[]
[]
[]
[]
[]
[]
[]
[]
[]
[]
[]
[]
[]
[]
[]
[]
[]
[]
[]
[]
[]
[]
[]
[]
[]
[]
[]
[]
[]
[]
[]
[]
[]
[]
[]
[]
[]
[]
[]
[]
[]
[]
[]
[]
[]
[]
[]
[]
[]
[]
[]
[]
[]
[]
[]
[]
[]
[]
[]
[]
[]
[]
[]
[]
[]
[]
[]
[]
[]
[]
[]
[]
[]
[]
[]
[]
[]
[]
[]
[]
[]
[]
[]
[]
[]
[]
[]
[]
[]
[]
[]
[]
[]
[]
[]
[]
[]
[]
[]
[]
[]
[]
[]
[]
[]
[]
[]
[]
[]
[]
[]
[]
[]
[]
[]
[]
[]
[]
[]
[]
[]
[]
[]
[]
[]
[]
[]
[]
[]
[]
[]
[]
[]
[]
[]
[]
[]
[]
[]
[]
[]
[]
[]
[]
[]
[]
[]
[]
[]
[]
[]
[]
[]
[]
[]
[]
[]
[]
[]
[]
[]
[]
[]
[]
[]
[]
[]
[]
[]
[]
[]
[]
[]
[]
[]
[]
[]
[]
[]
[]
[]
[]
[]
[]
[]
[]
[]
[]
[]
[]
[]
[]
[]
[]
[]
[]
[]
[]
[]
[]
[]
[]
[]
[]
[]
[]
[]
[]
[]
[]
[]
[]
[]
[]
[]
[]
[]
[]
[]
[]
[]
[]
[]
[]
[]
[]
[]
[]
[]
[]
[]
[]
[]
[]
[]
[]
[]
[]
[]
[]
[]
[]
[]
[]
[]
[]
[]
[]
[]
[]
[]
[]
[]
[]
[]
[]
[]
[]
[]
[]
[]
[]
[]
[]
[]
[]
[]
[]
[]
[]
[]
[]
[]
[]
[]
[]
[]
[]
[]
[]
[]
[]
[]
[]
[]
[]
[]
[]
[]
[]
[]
[]
[]
[]
[]
[]
[]
[]
[]
[]
[]
[]
[]
[]
[]
[]
[]
[]
[]
[]
[]
[]
[]
[]
[]
[]
[]
[]
[]
[]
[]
[]
[]
[]
[]
[]
[]
[]
[]
[]
[]
[]
[]
[]
[]
[]
[]
[]
[]
[]
[]
[]
[]
[]
[]
[]
[]
[]
[]
[]
[]
[]
[]
[]
[]
[]
[]
[]
[]
[]
[]
[]
[]
[]
[]
[]
[]
[]
[]
[]
[]
[]
[]
[]
[]
[]
[]
[]
[]
[]
[]
[]
[]
[]
[]
[]
[]
[]
[]
[]
[]
[]
[]
[]
[]
[]
[]
[]
[]
[]
[]
[]
[]
[]
[]
[]
[]
[]
[]
[]
[]
[]
[]
[]
[]
[]
[]
[]
[]
[]
[]
[]
[]
[]
[]
[]
[]
[]
[]
[]
[]
[]
[]
[]
[]
[]
[]
[]
[]
[]
[]
[]
[]
[]
[]
[]
[]
[]
[]
[]
[]
[]
[]
[]
[]
[]
[]
[]
[]
[]
[]
[]
[]
[]
[]
[]
[]
[]
[]
[]
[]
[]
[]
[]
[]
[]
[]
[]
[]
[]
[]
[]
[]
[]
[]
[]
[]
[]
[]
[]
[]
[]
[]
[]
[]
[]
[]
[]
[]
[]
[]
[]
[]
[]
[]
[]
[]
[]
[]
[]
[]
[]
[]
[]
[]
[]
[]
[]
[]
[]
[]
[]
[]
[]
[]
[]
[]
[]
[]
[]
[]
[]
[]
[]
[]
[]
[]
[]
[]
[]
[]
[]
[]
[]
[]
[]
[]
[]
[]
[]
[]
[]
[]
[]
[]
[]
[]
[]
[]
[]
[]
[]
[]
[]
[]
[]
[]
[]
[]
[]
[]
[]
[]
[]
[]
[]
[]
[]
[]
[]
[]
[]
[]
[]
[]
[]
[]
[]
[]
[]
[]
[]
[]
[]
[]
[]
[]
[]
[]
[]
[]
[]
[]
[]
[]
[]
[]
[]
[]
[]
[]
[]
[]
[]
[null,null,null,null,null,null,null,null,null,null,null,null,null,false]

{"sheet":"11월 (2)","index":4,"n_rows":4946,"n_cols":19,"rows_kept":4946,"cut":false,"hidden":false,"merged":[[5,13,5,14],[7,1,7,2],[7,3,7,4],[7,5,7,6],[7,7,7,8],[7,9,7,10],[7,11,7,12],[7,13,7,14],[0,5,0,14],[1,1,3,2],[1,5,3,14],[2,3,3,3],[5,1,5,2],[5,3,5,4],[5,5,5,6],[5,7,5,8],[5,9,5,10],[5,11,5,12],[8,13,8,14],[9,1,9,2],[9,3,9,4],[9,5,9,6],[9,7,9,8],[9,9,9,10],[9,11,9,12],[9,13,9,14],[8,1,8,2],[8,3,8,4],[8,5,8,6],[8,7,8,8],[8,9,8,10],[8,11,8,12],[10,13,10,14],[11,1,11,2],[11,3,11,4],[11,5,11,6],[11,7,11,8],[11,9,11,10],[11,11,11,12],[11,13,11,14],[10,1,10,2],[10,3,10,4],[10,5,10,6],[10,7,10,8],[10,9,10,10],[10,11,10,12],[13,13,13,14],[14,1,14,2],[14,3,14,4],[14,5,14,6],[14,7,14,8],[14,9,14,10],[14,11,14,12],[14,13,14,14],[13,1,13,2],[13,3,13,4],[13,5,13,6],[13,7,13,8],[13,9,13,10],[13,11,13,12],[15,13,15,14],[16,1,16,2],[16,3,16,4],[16,5,16,6],[16,7,16,8],[16,9,16,10],[16,11,16,12],[16,13,16,14],[15,1,15,2],[15,3,15,4],[15,5,15,6],[15,7,15,8],[15,9,15,10],[15,11,15,12],[17,13,17,14],[19,1,19,2],[19,3,19,4],[19,5,19,6],[19,7,19,8],[19,9,19,10],[19,11,19,12],[19,13,19,14],[17,1,17,2],[17,3,17,4],[17,5,17,6],[17,7,17,8],[17,9,17,10],[17,11,17,12],[20,13,20,14],[21,1,21,2],[21,3,21,4],[21,5,21,6],[21,7,21,8],[21,9,21,10],[21,11,21,12],[21,13,21,14],[20,1,20,2],[20,3,20,4],[20,5,20,6],[20,7,20,8],[20,9,20,10],[20,11,20,12],[22,13,22,14],[23,1,23,2],[23,3,23,4],[23,5,23,6],[23,7,23,8],[23,9,23,10],[23,11,23,12],[23,13,23,14],[22,1,22,2],[22,3,22,4],[22,5,22,6],[22,7,22,8],[22,9,22,10],[22,11,22,12],[25,13,25,14],[26,1,26,2],[26,3,26,4],[26,5,26,6],[26,7,26,8],[26,9,26,10],[26,11,26,12],[26,13,26,14],[25,1,25,2],[25,3,25,4],[25,5,25,6],[25,7,25,8],[25,9,25,10],[25,11,25,12],[27,13,27,14],[28,1,28,2],[28,3,28,4],[28,5,28,6],[28,7,28,8],[28,9,28,10],[28,11,28,12],[28,13,28,14],[27,1,27,2],[27,3,27,4],[27,5,27,6],[27,7,27,8],[27,9,27,10],[27,11,27,12],[29,13,29,14],[31,1,31,2],[31,3,31,4],[31,5,31,6],[31,7,31,8],[31,9,31,10],[31,11,31,12],[31,13,31,14],[29,1,29,2],[29,3,29,4],[29,5,29,6],[29,7,29,8],[29,9,29,10],[29,11,29,12],[32,13,32,14],[33,1,33,2],[33,3,33,4],[33,5,33,6],[33,7,33,8],[33,9,33,10],[33,11,33,12],[33,13,33,14],[32,1,32,2],[32,3,32,4],[32,5,32,6],[32,7,32,8],[32,9,32,10],[32,11,32,12],[37,13,37,14],[50,11,50,14],[37,1,37,2],[37,3,37,4],[37,5,37,6],[37,7,37,8],[37,9,37,10],[37,11,37,12],[34,13,34,14],[35,1,35,2],[35,3,35,4],[35,5,35,6],[35,7,35,8],[35,9,35,10],[35,11,35,12],[35,13,35,14],[34,1,34,2],[34,3,34,4],[34,5,34,6],[34,7,34,8],[34,9,34,10],[34,11,34,12]]}
[]
[null,11,null,2022,null,"불기 2566년   단기 4355년  서기 2022년"]
[null,null,null,{"$f":"TEXT(DATE(D2,B2,1),\"mmmm\")","v":"November"},null,null,null,null,null,null,null,null,null,null,null,null,null,null,"←클릭 전 주의해주세요!"]
[]
[]
[null,{"$f":"IF(연간!$B$2=\"S\",\"SUN\",IF(연간!$B$2=\"M\",\"MON\"))","v":"SUN"},null,{"$f":"IF(연간!$B$2=\"S\",\"MON\",IF(연간!$B$2=\"M\",\"TUE\"))","v":"MON"},null,{"$f":"IF(연간!$B$2=\"S\",\"TUE\",IF(연간!$B$2=\"M\",\"WED\"))","v":"TUE"},null,{"$f":"IF(연간!$B$2=\"S\",\"WED\",IF(연간!$B$2=\"M\",\"THU\"))","v":"WED"},null,{"$f":"IF(연간!$B$2=\"S\",\"THU\",IF(연간!$B$2=\"M\",\"FRI\"))","v":"THU"},null,{"$f":"IF(연간!$B$2=\"S\",\"FRI\",IF(연간!$B$2=\"M\",\"SAT\"))","v":"FRI"},null,{"$f":"IF(연간!$B$2=\"S\",\"SAT\",IF(연간!$B$2=\"M\",\"SUN\"))","v":"SAT"}]
[null,null,{"$f":"IF(연간!$B$2=\"M\",(IF(DAY(DATE($D$2,$B$2,1)-WEEKDAY(DATE($D$2,$B$2,1))+2)=2,DATE($D$2,$B$2,1)-WEEKDAY(DATE($D$2,$B$2,1))-5,DATE($D$2,$B$2,1)-WEEKDAY(DATE($D$2,$B$2,1))+2)),IF(연간!$B$2=\"S\",DATE($D$2,$B$2,1)-WEEKDAY(DATE($D$2,$B$2,1))+1))","v":"2022-10-30"},null,{"$f":"C7+1","v":"2022-10-31"},null,{"$f":"C7+2","v":"2022-11-01"},null,{"$f":"C7+3","v":"2022-11-02"},null,{"$f":"C7+4","v":"2022-11-03"},null,{"$f":"C7+5","v":"2022-11-04"},null,{"$f":"C7+6","v":"2022-11-05"},null,"개인일정"]
[null,{"$f":"TEXT(C7,\"[$-000E0000]m/d\")","v":"10/6"},null,{"$f":"TEXT(E7,\"[$-000E0000]m/d\")","v":"10/7"},null,{"$f":"TEXT(G7,\"[$-000E0000]m/d\")","v":"10/8"},null,{"$f":"TEXT(I7,\"[$-000E0000]m/d\")","v":"10/9"},null,{"$f":"TEXT(K7,\"[$-000E0000]m/d\")","v":"10/10"},null,{"$f":"TEXT(M7,\"[$-000E0000]m/d\")","v":"10/11"},null,{"$f":"TEXT(O7,\"[$-000E0000]m/d\")","v":"10/12"},null,null,"업무일정"]
[null,null,null,null,null,null,null,null,null,null,null,null,null,null,null,null,"중요일정"]
[null,null,null,null,null,null,null,null,null,null,null,null,null,null,null,null,"기념일"]
[]
[]
[null,null,{"$f":"C7+7","v":"2022-11-06"},null,{"$f":"C7+8","v":"2022-11-07"},null,{"$f":"C7+9","v":"2022-11-08"},null,{"$f":"C7+10","v":"2022-11-09"},null,{"$f":"C7+11","v":"2022-11-10"},null,{"$f":"C7+12","v":"2022-11-11"},null,{"$f":"C7+13","v":"2022-11-12"}]
[null,{"$f":"TEXT(C13,\"[$-000E0000]m/d\")","v":"10/13"},null,{"$f":"TEXT(E13,\"[$-000E0000]m/d\")","v":"10/14"},null,{"$f":"TEXT(G13,\"[$-000E0000]m/d\")","v":"10/15"},null,{"$f":"TEXT(I13,\"[$-000E0000]m/d\")","v":"10/16"},null,{"$f":"TEXT(K13,\"[$-000E0000]m/d\")","v":"10/17"},null,{"$f":"TEXT(M13,\"[$-000E0000]m/d\")","v":"10/18"},null,{"$f":"TEXT(O13,\"[$-000E0000]m/d\")","v":"10/19"}]
[]
[]
[]
[]
[null,null,{"$f":"C7+14","v":"2022-11-13"},null,{"$f":"C7+15","v":"2022-11-14"},null,{"$f":"C7+16","v":"2022-11-15"},null,{"$f":"C7+17","v":"2022-11-16"},null,{"$f":"C7+18","v":"2022-11-17"},null,{"$f":"C7+19","v":"2022-11-18"},null,{"$f":"C7+20","v":"2022-11-19"}]
[null,{"$f":"TEXT(C19,\"[$-000E0000]m/d\")","v":"10/20"},null,{"$f":"TEXT(E19,\"[$-000E0000]m/d\")","v":"10/21"},null,{"$f":"TEXT(G19,\"[$-000E0000]m/d\")","v":"10/22"},null,{"$f":"TEXT(I19,\"[$-000E0000]m/d\")","v":"10/23"},null,{"$f":"TEXT(K19,\"[$-000E0000]m/d\")","v":"10/24"},null,{"$f":"TEXT(M19,\"[$-000E0000]m/d\")","v":"10/25"},null,{"$f":"TEXT(O19,\"[$-000E0000]m/d\")","v":"10/26"}]
[]
[]
[]
[]
[null,null,{"$f":"C7+21","v":"2022-11-20"},null,{"$f":"C7+22","v":"2022-11-21"},null,{"$f":"C7+23","v":"2022-11-22"},null,{"$f":"C7+24","v":"2022-11-23"},null,{"$f":"C7+25","v":"2022-11-24"},null,{"$f":"C7+26","v":"2022-11-25"},null,{"$f":"C7+27","v":"2022-11-26"}]
[null,{"$f":"TEXT(C25,\"[$-000E0000]m/d\")","v":"10/27"},null,{"$f":"TEXT(E25,\"[$-000E0000]m/d\")","v":"10/28"},null,{"$f":"TEXT(G25,\"[$-000E0000]m/d\")","v":"10/29"},null,{"$f":"TEXT(I25,\"[$-000E0000]m/d\")","v":"10/30"},null,{"$f":"TEXT(K25,\"[$-000E0000]m/d\")","v":"11/1"},null,{"$f":"TEXT(M25,\"[$-000E0000]m/d\")","v":"11/2"},null,{"$f":"TEXT(O25,\"[$-000E0000]m/d\")","v":"11/3"}]
[]
[]
[]
[]
[null,null,{"$f":"C13+21","v":"2022-11-27"},null,{"$f":"C13+22","v":"2022-11-28"},null,{"$f":"C13+23","v":"2022-11-29"},null,{"$f":"C13+24","v":"2022-11-30"},null,{"$f":"C13+25","v":"2022-12-01"},null,{"$f":"C13+26","v":"2022-12-02"},null,{"$f":"C13+27","v":"2022-12-03"}]
[null,{"$f":"TEXT(C31,\"[$-000E0000]m/d\")","v":"11/4"},null,{"$f":"TEXT(E31,\"[$-000E0000]m/d\")","v":"11/5"},null,{"$f":"TEXT(G31,\"[$-000E0000]m/d\")","v":"11/6"},null,{"$f":"TEXT(I31,\"[$-000E0000]m/d\")","v":"11/7"},null,{"$f":"TEXT(K31,\"[$-000E0000]m/d\")","v":"11/8"},null,{"$f":"TEXT(M31,\"[$-000E0000]m/d\")","v":"11/9"},null,{"$f":"TEXT(O31,\"[$-000E0000]m/d\")","v":"11/10"}]
[]
[]
[]
[]
[null,null,{"$f":"C13+28","v":"2022-12-04"},null,{"$f":"C13+29","v":"2022-12-05"},null,{"$f":"C13+30","v":"2022-12-06"},null,{"$f":"C13+31","v":"2022-12-07"},null,{"$f":"C13+32","v":"2022-12-08"},null,{"$f":"C13+33","v":"2022-12-09"},null,{"$f":"C13+34","v":"2022-12-10"}]
[null,{"$f":"TEXT(C37,\"[$-000E0000]m/d\")","v":"11/11"},null,{"$f":"TEXT(E37,\"[$-000E0000]m/d\")","v":"11/12"},null,{"$f":"TEXT(G37,\"[$-000E0000]m/d\")","v":"11/13"},null,{"$f":"TEXT(I37,\"[$-000E0000]m/d\")","v":"11/14"},null,{"$f":"TEXT(K37,\"[$-000E0000]m/d\")","v":"11/15"},null,{"$f":"TEXT(M37,\"[$-000E0000]m/d\")","v":"11/16"},null,{"$f":"TEXT(O37,\"[$-000E0000]m/d\")","v":"11/17"}]
[]
[]
[]
[]
[1,null,null,null,null,false,null,null,null,null,null,null,null,false]
[2,false,null,false,null,false,null,false,null,false,null,false,null,false]
[3,false,null,false,null,false,null,false,null,false,null,false,null,false]
[4,false,null,false,null,false,null,false,null,false,null,false,null,false]
[5,false,null,false,null,false,null,false,null,false,null,false,null,false]
[6,false,null,false,null,false,null,false,null,false,null,false,null,false]
[]
[]
[]
[]
[]
[]
[]
[]
[]
[]
[]
[]
[]
[]
[]
[]
[]
[]
[]
[]
[]
[]
[]
[]
[]
[]
[]
[]
[]
[]
[]
[]
[]
[]
[]
[]
[]
[]
[]
[]
[]
[]
[]
[]
[]
[]
[]
[]
[]
[]
[]
[]
[]
[]
[]
[]
[]
[]
[]
[]
[]
[]
[]
[]
[]
[]
[]
[]
[]
[]
[]
[]
[]
[]
[]
[]
[]
[]
[]
[]
[]
[]
[]
[]
[]
[]
[]
[]
[]
[]
[]
[]
[]
[]
[]
[]
[]
[]
[]
[]
[]
[]
[]
[]
[]
[]
[]
[]
[]
[]
[]
[]
[]
[]
[]
[]
[]
[]
[]
[]
[]
[]
[]
[]
[]
[]
[]
[]
[]
[]
[]
[]
[]
[]
[]
[]
[]
[]
[]
[]
[]
[]
[]
[]
[]
[]
[]
[]
[]
[]
[]
[]
[]
[]
[]
[]
[]
[]
[]
[]
[]
[]
[]
[]
[]
[]
[]
[]
[]
[]
[]
[]
[]
[]
[]
[]
[]
[]
[]
[]
[]
[]
[]
[]
[]
[]
[]
[]
[]
[]
[]
[]
[]
[]
[]
[]
[]
[]
[]
[]
[]
[]
[]
[]
[]
[]
[]
[]
[]
[]
[]
[]
[]
[]
[]
[]
[]
[]
[]
[]
[]
[]
[]
[]
[]
[]
[]
[]
[]
[]
[]
[]
[]
[]
[]
[]
[]
[]
[]
[]
[]
[]
[]
[]
[]
[]
[]
[]
[]
[]
[]
[]
[]
[]
[]
[]
[]
[]
[]
[]
[]
[]
[]
[]
[]
[]
[]
[]
[]
[]
[]
[]
[]
[]
[]
[]
[]
[]
[]
[]
[]
[]
[]
[]
[]
[]
[]
[]
[]
[]
[]
[]
[]
[]
[]
[]
[]
[]
[]
[]
[]
[]
[]
[]
[]
[]
[]
[]
[]
[]
[]
[]
[]
[]
[]
[]
[]
[]
[]
[]
[]
[]
[]
[]
[]
[]
[]
[]
[]
[]
[]
[]
[]
[]
[]
[]
[]
[]
[]
[]
[]
[]
[]
[]
[]
[]
[]
[]
[]
[]
[]
[]
[]
[]
[]
[]
[]
[]
[]
[]
[]
[]
[]
[]
[]
[]
[]
[]
[]
[]
[]
[]
[]
[]
[]
[]
[]
[]
[]
[]
[]
[]
[]
[]
[]
[]
[]
[]
[]
[]
[]
[]
[]
[]
[]
[]
[]
[]
[]
[]
[]
[]
[]
[]
[]
[]
[]
[]
[]
[]
[]
[]
[]
[]
[]
[]
[]
[]
[]
[]
[]
[]
[]
[]
[]
[]
[]
[]
[]
[]
[]
[]
[]
[]
[]
[]
[]
[]
[]
[]
[]
[]
[]
[]
[]
[]
[]
[]
[]
[]
[]
[]
[]
[]
[]
[]
[]
[]
[]
[]
[]
[]
[]
[]
[]
[]
[]
[]
[]
[]
[]
[]
[]
[]
[]
[]
[]
[]
[]
[]
[]
[]
[]
[]
[]
[]
[]
[]
[]
[]
[]
[]
[]
[]
[]
[]
[]
[]
[]
[]
[]
[]
[]
[]
[]
[]
[]
[]
[]
[]
[]
[]
[]
[]
[]
[]
[]
[]
[]
[]
[]
[]
[]
[]
[]
[]
[]
[]
[]
[]
[]
[]
[]
[]
[]
[]
[]
[]
[]
[]
[]
[]
[]
[]
[]
[]
[]
[]
[]
[]
[]
[]
[]
[]
[]
[]
[]
[]
[]
[]
[]
[]
[]
[]
[]
[]
[]
[]
[]
[]
[]
[]
[]
[]
[]
[]
[]
[]
[]
[]
[]
[]
[]
[]
[]
[]
[]
[]
[]
[]
[]
[]
[]
[]
[]
[]
[]
[]
[]
[]
[]
[]
[]
[]
[]
[]
[]
[]
[]
[]
[]
[]
[]
[]
[]
[]
[]
[]
[]
[]
[]
[]
[]
[]
[]
[]
[]
[]
[]
[]
[]
[]
[]
[]
[]
[]
[]
[]
[]
[]
[]
[]
[]
[]
[]
[]
[]
[]
[]
[]
[]
[]
[]
[]
[]
[]
[]
[]
[]
[]
[]
[]
[]
[]
[]
[]
[]
[]
[]
[]
[]
[]
[]
[]
[]
[]
[]
[]
[]
[]
[]
[]
[]
[]
[]
[]
[]
[]
[]
[]
[]
[]
[]
[]
[]
[]
[]
[]
[]
[]
[]
[]
[]
[]
[]
[]
[]
[]
[]
[]
[]
[]
[]
[]
[]
[]
[]
[]
[]
[]
[]
[]
[]
[]
[]
[]
[]
[]
[]
[]
[]
[]
[]
[]
[]
[]
[]
[]
[]
[]
[]
[]
[]
[]
[]
[]
[]
[]
[]
[]
[]
[]
[]
[]
[]
[]
[]
[]
[]
[]
[]
[]
[]
[]
[]
[]
[]
[]
[]
[]
[]
[]
[]
[]
[]
[]
[]
[]
[]
[]
[]
[]
[]
[]
[]
[]
[]
[]
[]
[]
[]
[]
[]
[]
[]
[]
[]
[]
[]
[]
[]
[]
[]
[]
[]
[]
[]
[]
[]
[]
[]
[]
[]
[]
[]
[]
[]
[]
[]
[]
[]
[]
[]
[]
[]
[]
[]
[]
[]
[]
[]
[]
[]
[]
[]
[]
[]
[]
[]
[]
[]
[]
[]
[]
[]
[]
[]
[]
[]
[]
[]
[]
[]
[]
[]
[]
[]
[]
[]
[]
[]
[]
[]
[]
[]
[]
[]
[]
[]
[]
[]
[]
[]
[]
[]
[]
[]
[]
[]
[]
[]
[]
[]
[]
[]
[]
[]
[]
[]
[]
[]
[]
[]
[]
[]
[]
[]
[]
[]
[]
[]
[]
[]
[]
[]
[]
[]
[]
[]
[]
[]
[]
[]
[]
[]
[]
[]
[]
[]
[]
[]
[]
[]
[]
[]
[]
[]
[]
[]
[]
[]
[]
[]
[]
[]
[]
[]
[]
[]
[]
[]
[]
[]
[]
[]
[]
[]
[]
[]
[]
[]
[]
[]
[]
[]
[]
[]
[]
[]
[]
[]
[]
[]
[]
[]
[]
[]
[]
[]
[]
[]
[]
[]
[]
[]
[]
[]
[]
[]
[]
[]
[]
[]
[]
[]
[]
[]
[]
[]
[]
[]
[]
[]
[]
[]
[]
[]
[]
[]
[]
[]
[]
[]
[]
[]
[]
[]
[]
[]
[]
[]
[]
[]
[]
[]
[]
[]
[]
[]
[]
[]
[]
[]
[]
[]
[]
[]
[]
[]
[]
[]
[]
[]
[]
[]
[]
[]
[]
[]
[]
[]
[]
[]
[]
[]
[]
[]
[]
[]
[]
[]
[]
[]
[]
[]
[]
[]
[]
[]
[]
[]
[]
[]
[]
[]
[]
[]
[]
[]
[]
[]
[]
[]
[]
[]
[]
[]
[]
[]
[]
[]
[]
[]
[]
[]
[]
[]
[]
[]
[]
[]
[]
[]
[]
[]
[]
[]
[]
[]
[]
[]
[]
[]
[]
[]
[]
[]
[]
[]
[]
[]
[]
[]
[]
[]
[]
[]
[]
[]
[]
[]
[]
[]
[]
[]
[]
[]
[]
[]
[]
[]
[]
[]
[]
[]
[]
[]
[]
[]
[]
[]
[]
[]
[]
[]
[]
[]
[]
[]
[]
[]
[]
[]
[]
[]
[]
[]
[]
[]
[]
[]
[]
[]
[]
[]
[]
[]
[]
[]
[]
[]
[]
[]
[]
[]
[]
[]
[]
[]
[]
[]
[]
[]
[]
[]
[]
[]
[]
[]
[]
[]
[]
[]
[]
[]
[]
[]
[]
[]
[]
[]
[]
[]
[]
[]
[]
[]
[]
[]
[]
[]
[]
[]
[]
[]
[]
[]
[]
[]
[]
[]
[]
[]
[]
[]
[]
[]
[]
[]
[]
[]
[]
[]
[]
[]
[]
[]
[]
[]
[]
[]
[]
[]
[]
[]
[]
[]
[]
[]
[]
[]
[]
[]
[]
[]
[]
[]
[]
[]
[]
[]
[]
[]
[]
[]
[]
[]
[]
[]
[]
[]
[]
[]
[]
[]
[]
[]
[]
[]
[]
[]
[]
[]
[]
[]
[]
[]
[]
[]
[]
[]
[]
[]
[]
[]
[]
[]
[]
[]
[]
[]
[]
[]
[]
[]
[]
[]
[]
[]
[]
[]
[]
[]
[]
[]
[]
[]
[]
[]
[]
[]
[]
[]
[]
[]
[]
[]
[]
[]
[]
[]
[]
[]
[]
[]
[]
[]
[]
[]
[]
[]
[]
[]
[]
[]
[]
[]
[]
[]
[]
[]
[]
[]
[]
[]
[]
[]
[]
[]
[]
[]
[]
[]
[]
[]
[]
[]
[]
[]
[]
[]
[]
[]
[]
[]
[]
[]
[]
[]
[]
[]
[]
[]
[]
[]
[]
[]
[]
[]
[]
[]
[]
[]
[]
[]
[]
[]
[]
[]
[]
[]
[]
[]
[]
[]
[]
[]
[]
[]
[]
[]
[]
[]
[]
[]
[]
[]
[]
[]
[]
[]
[]
[]
[]
[]
[]
[]
[]
[]
[]
[]
[]
[]
[]
[]
[]
[]
[]
[]
[]
[]
[]
[]
[]
[]
[]
[]
[]
[]
[]
[]
[]
[]
[]
[]
[]
[]
[]
[]
[]
[]
[]
[]
[]
[]
[]
[]
[]
[]
[]
[]
[]
[]
[]
[]
[]
[]
[]
[]
[]
[]
[]
[]
[]
[]
[]
[]
[]
[]
[]
[]
[]
[]
[]
[]
[]
[]
[]
[]
[]
[]
[]
[]
[]
[]
[]
[]
[]
[]
[]
[]
[]
[]
[]
[]
[]
[]
[]
[]
[]
[]
[]
[]
[]
[]
[]
[]
[]
[]
[]
[]
[]
[]
[]
[]
[]
[]
[]
[]
[]
[]
[]
[]
[]
[]
[]
[]
[]
[]
[]
[]
[]
[]
[]
[]
[]
[]
[]
[]
[]
[]
[]
[]
[]
[]
[]
[]
[]
[]
[]
[]
[]
[]
[]
[]
[]
[]
[]
[]
[]
[]
[]
[]
[]
[]
[]
[]
[]
[]
[]
[]
[]
[]
[]
[]
[]
[]
[]
[]
[]
[]
[]
[]
[]
[]
[]
[]
[]
[]
[]
[]
[]
[]
[]
[]
[]
[]
[]
[]
[]
[]
[]
[]
[]
[]
[]
[]
[]
[]
[]
[]
[]
[]
[]
[]
[]
[]
[]
[]
[]
[]
[]
[]
[]
[]
[]
[]
[]
[]
[]
[]
[]
[]
[]
[]
[]
[]
[]
[]
[]
[]
[]
[]
[]
[]
[]
[]
[]
[]
[]
[]
[]
[]
[]
[]
[]
[]
[]
[]
[]
[]
[]
[]
[]
[]
[]
[]
[]
[]
[]
[]
[]
[]
[]
[]
[]
[]
[]
[]
[]
[]
[]
[]
[]
[]
[]
[]
[]
[]
[]
[]
[]
[]
[]
[]
[]
[]
[]
[]
[]
[]
[]
[]
[]
[]
[]
[]
[]
[]
[]
[]
[]
[]
[]
[]
[]
[]
[]
[]
[]
[]
[]
[]
[]
[]
[]
[]
[]
[]
[]
[]
[]
[]
[]
[]
[]
[]
[]
[]
[]
[]
[]
[]
[]
[]
[]
[]
[]
[]
[]
[]
[]
[]
[]
[]
[]
[]
[]
[]
[]
[]
[]
[]
[]
[]
[]
[]
[]
[]
[]
[]
[]
[]
[]
[]
[]
[]
[]
[]
[]
[]
[]
[]
[]
[]
[]
[]
[]
[]
[]
[]
[]
[]
[]
[]
[]
[]
[]
[]
[]
[]
[]
[]
[]
[]
[]
[]
[]
[]
[]
[]
[]
[]
[]
[]
[]
[]
[]
[]
[]
[]
[]
[]
[]
[]
[]
[]
[]
[]
[]
[]
[]
[]
[]
[]
[]
[]
[]
[]
[]
[]
[]
[]
[]
[]
[]
[]
[]
[]
[]
[]
[]
[]
[]
[]
[]
[]
[]
[]
[]
[]
[]
[]
[]
[]
[]
[]
[]
[]
[]
[]
[]
[]
[]
[]
[]
[]
[]
[]
[]
[]
[]
[]
[]
[]
[]
[]
[]
[]
[]
[]
[]
[]
[]
[]
[]
[]
[]
[]
[]
[]
[]
[]
[]
[]
[]
[]
[]
[]
[]
[]
[]
[]
[]
[]
[]
[]
[]
[]
[]
[]
[]
[]
[]
[]
[]
[]
[]
[]
[]
[]
[]
[]
[]
[]
[]
[]
[]
[]
[]
[]
[]
[]
[]
[]
[]
[]
[]
[]
[]
[]
[]
[]
[]
[]
[]
[]
[]
[]
[]
[]
[]
[]
[]
[]
[]
[]
[]
[]
[]
[]
[]
[]
[]
[]
[]
[]
[]
[]
[]
[]
[]
[]
[]
[]
[]
[]
[]
[]
[]
[]
[]
[]
[]
[]
[]
[]
[]
[]
[]
[]
[]
[]
[]
[]
[]
[]
[]
[]
[]
[]
[]
[]
[]
[]
[]
[]
[]
[]
[]
[]
[]
[]
[]
[]
[]
[]
[]
[]
[]
[]
[]
[]
[]
[]
[]
[]
[]
[]
[]
[]
[]
[]
[]
[]
[]
[]
[]
[]
[]
[]
[]
[]
[]
[]
[]
[]
[]
[]
[]
[]
[]
[]
[]
[]
[]
[]
[]
[]
[]
[]
[]
[]
[]
[]
[]
[]
[]
[]
[]
[]
[]
[]
[]
[]
[]
[]
[]
[]
[]
[]
[]
[]
[]
[]
[]
[]
[]
[]
[]
[]
[]
[]
[]
[]
[]
[]
[]
[]
[]
[]
[]
[]
[]
[]
[]
[]
[]
[]
[]
[]
[]
[]
[]
[]
[]
[]
[]
[]
[]
[]
[]
[]
[]
[]
[]
[]
[]
[]
[]
[]
[]
[]
[]
[]
[]
[]
[]
[]
[]
[]
[]
[]
[]
[]
[]
[]
[]
[]
[]
[]
[]
[]
[]
[]
[]
[]
[]
[]
[]
[]
[]
[]
[]
[]
[]
[]
[]
[]
[]
[]
[]
[]
[]
[]
[]
[]
[]
[]
[]
[]
[]
[]
[]
[]
[]
[]
[]
[]
[]
[]
[]
[]
[]
[]
[]
[]
[]
[]
[]
[]
[]
[]
[]
[]
[]
[]
[]
[]
[]
[]
[]
[]
[]
[]
[]
[]
[]
[]
[]
[]
[]
[]
[]
[]
[]
[]
[]
[]
[]
[]
[]
[]
[]
[]
[]
[]
[]
[]
[]
[]
[]
[]
[]
[]
[]
[]
[]
[]
[]
[]
[]
[]
[]
[]
[]
[]
[]
[]
[]
[]
[]
[]
[]
[]
[]
[]
[]
[]
[]
[]
[]
[]
[]
[]
[]
[]
[]
[]
[]
[]
[]
[]
[]
[]
[]
[]
[]
[]
[]
[]
[]
[]
[]
[]
[]
[]
[]
[]
[]
[]
[]
[]
[]
[]
[]
[]
[]
[]
[]
[]
[]
[]
[]
[]
[]
[]
[]
[]
[]
[]
[]
[]
[]
[]
[]
[]
[]
[]
[]
[]
[]
[]
[]
[]
[]
[]
[]
[]
[]
[]
[]
[]
[]
[]
[]
[]
[]
[]
[]
[]
[]
[]
[]
[]
[]
[]
[]
[]
[]
[]
[]
[]
[]
[]
[]
[]
[]
[]
[]
[]
[]
[]
[]
[]
[]
[]
[]
[]
[]
[]
[]
[]
[]
[]
[]
[]
[]
[]
[]
[]
[]
[]
[]
[]
[]
[]
[]
[]
[]
[]
[]
[]
[]
[]
[]
[]
[]
[]
[]
[]
[]
[]
[]
[]
[]
[]
[]
[]
[]
[]
[]
[]
[]
[]
[]
[]
[]
[]
[]
[]
[]
[]
[]
[]
[]
[]
[]
[]
[]
[]
[]
[]
[]
[]
[]
[]
[]
[]
[]
[]
[]
[]
[]
[]
[]
[]
[]
[]
[]
[]
[]
[]
[]
[]
[]
[]
[]
[]
[]
[]
[]
[]
[]
[]
[]
[]
[]
[]
[]
[]
[]
[]
[]
[]
[]
[]
[]
[]
[]
[]
[]
[]
[]
[]
[]
[]
[]
[]
[]
[]
[]
[]
[]
[]
[]
[]
[]
[]
[]
[]
[]
[]
[]
[]
[]
[]
[]
[]
[]
[]
[]
[]
[]
[]
[]
[]
[]
[]
[]
[]
[]
[]
[]
[]
[]
[]
[]
[]
[]
[]
[]
[]
[]
[]
[]
[]
[]
[]
[]
[]
[]
[]
[]
[]
[]
[]
[]
[]
[]
[]
[]
[]
[]
[]
[]
[]
[]
[]
[]
[]
[]
[]
[]
[]
[]
[]
[]
[]
[]
[]
[]
[]
[]
[]
[]
[]
[]
[]
[]
[]
[]
[]
[]
[]
[]
[]
[]
[]
[]
[]
[]
[]
[]
[]
[]
[]
[]
[]
[]
[]
[]
[]
[]
[]
[]
[]
[]
[]
[]
[]
[]
[]
[]
[]
[]
[]
[]
[]
[]
[]
[]
[]
[]
[]
[]
[]
[]
[]
[]
[]
[]
[]
[]
[]
[]
[]
[]
[]
[]
[]
[]
[]
[]
[]
[]
[]
[]
[]
[]
[]
[]
[]
[]
[]
[]
[]
[]
[]
[]
[]
[]
[]
[]
[]
[]
[]
[]
[]
[]
[]
[]
[]
[]
[]
[]
[]
[]
[]
[]
[]
[]
[]
[]
[]
[]
[]
[]
[]
[]
[]
[]
[]
[]
[]
[]
[]
[]
[]
[]
[]
[]
[]
[]
[]
[]
[]
[]
[]
[]
[]
[]
[]
[]
[]
[]
[]
[]
[]
[]
[]
[]
[]
[]
[]
[]
[]
[]
[]
[]
[]
[]
[]
[]
[]
[]
[]
[]
[]
[]
[]
[]
[]
[]
[]
[]
[]
[]
[]
[]
[]
[]
[]
[]
[]
[]
[]
[]
[]
[]
[]
[]
[]
[]
[]
[]
[]
[]
[]
[]
[]
[]
[]
[]
[]
[]
[]
[]
[]
[]
[]
[]
[]
[]
[]
[]
[]
[]
[]
[]
[]
[]
[]
[]
[]
[]
[]
[]
[]
[]
[]
[]
[]
[]
[]
[]
[]
[]
[]
[]
[]
[]
[]
[]
[]
[]
[]
[]
[]
[]
[]
[]
[]
[]
[]
[]
[]
[]
[]
[]
[]
[]
[]
[]
[]
[]
[]
[]
[]
[]
[]
[]
[]
[]
[]
[]
[]
[]
[]
[]
[]
[]
[]
[]
[]
[]
[]
[]
[]
[]
[]
[]
[]
[]
[]
[]
[]
[]
[]
[]
[]
[]
[]
[]
[]
[]
[]
[]
[]
[]
[]
[]
[]
[]
[]
[]
[]
[]
[]
[]
[]
[]
[]
[]
[]
[]
[]
[]
[]
[]
[]
[]
[]
[]
[]
[]
[]
[]
[]
[]
[]
[]
[]
[]
[]
[]
[]
[]
[]
[]
[]
[]
[]
[]
[]
[]
[]
[]
[]
[]
[]
[]
[]
[]
[]
[]
[]
[]
[]
[]
[]
[]
[]
[]
[]
[]
[]
[]
[]
[]
[]
[]
[]
[]
[]
[]
[]
[]
[]
[]
[]
[]
[]
[]
[]
[]
[]
[]
[]
[]
[]
[]
[]
[]
[]
[]
[]
[]
[]
[]
[]
[]
[]
[]
[]
[]
[]
[]
[]
[]
[]
[]
[]
[]
[]
[]
[]
[]
[]
[]
[]
[]
[]
[]
[]
[]
[]
[]
[]
[]
[]
[]
[]
[]
[]
[]
[]
[]
[]
[]
[]
[]
[]
[]
[]
[]
[]
[]
[]
[]
[]
[]
[]
[]
[]
[]
[]
[]
[]
[]
[]
[]
[]
[]
[]
[]
[]
[]
[]
[]
[]
[]
[]
[]
[]
[]
[]
[]
[]
[]
[]
[]
[]
[]
[]
[]
[]
[]
[]
[]
[]
[]
[]
[]
[]
[]
[]
[]
[]
[]
[]
[]
[]
[]
[]
[]
[]
[]
[]
[]
[]
[]
[]
[]
[]
[]
[]
[]
[]
[]
[]
[]
[]
[]
[]
[]
[]
[]
[]
[]
[]
[]
[]
[]
[]
[]
[]
[]
[]
[]
[]
[]
[]
[]
[]
[]
[]
[]
[]
[]
[]
[]
[]
[]
[]
[]
[]
[]
[]
[]
[]
[]
[]
[]
[]
[]
[]
[]
[]
[]
[]
[]
[]
[]
[]
[]
[]
[]
[]
[]
[]
[]
[]
[]
[]
[]
[]
[]
[]
[]
[]
[]
[]
[]
[]
[]
[]
[]
[]
[]
[]
[]
[]
[]
[]
[]
[]
[]
[]
[]
[]
[]
[]
[]
[]
[]
[]
[]
[]
[]
[]
[]
[]
[]
[]
[]
[]
[]
[]
[]
[]
[]
[]
[]
[]
[]
[]
[]
[]
[]
[]
[]
[]
[]
[]
[]
[]
[]
[]
[]
[]
[]
[]
[]
[]
[]
[]
[]
[]
[]
[]
[]
[]
[]
[]
[]
[]
[]
[]
[]
[]
[]
[]
[]
[]
[]
[]
[]
[]
[]
[]
[]
[]
[]
[]
[]
[]
[]
[]
[]
[]
[]
[]
[]
[]
[]
[]
[]
[]
[]
[]
[]
[]
[]
[]
[]
[]
[]
[]
[]
[]
[]
[]
[]
[]
[]
[]
[]
[]
[]
[]
[]
[]
[]
[]
[]
[]
[]
[]
[]
[]
[]
[]
[]
[]
[]
[]
[]
[]
[]
[]
[]
[]
[]
[]
[]
[]
[]
[]
[]
[]
[]
[]
[]
[]
[]
[]
[]
[]
[]
[]
[]
[]
[]
[]
[]
[]
[]
[]
[]
[]
[]
[]
[]
[]
[]
[]
[]
[]
[]
[]
[]
[]
[]
[]
[]
[]
[]
[]
[]
[]
[]
[]
[]
[]
[]
[]
[]
[]
[]
[]
[]
[]
[]
[]
[]
[]
[]
[]
[]
[]
[]
[]
[]
[]
[]
[]
[]
[]
[]
[]
[]
[]
[]
[]
[]
[]
[]
[]
[]
[]
[]
[]
[]
[]
[]
[]
[]
[]
[]
[]
[]
[]
[]
[]
[]
[]
[]
[]
[]
[]
[]
[]
[]
[]
[]
[]
[]
[]
[]
[]
[]
[]
[]
[]
[]
[]
[]
[]
[]
[]
[]
[]
[]
[]
[]
[]
[]
[]
[]
[]
[]
[]
[]
[]
[]
[]
[]
[]
[]
[]
[]
[]
[]
[]
[]
[]
[]
[]
[]
[]
[]
[]
[]
[]
[]
[]
[]
[]
[]
[]
[]
[]
[]
[]
[]
[]
[]
[]
[]
[]
[]
[]
[]
[]
[]
[]
[]
[]
[]
[]
[]
[]
[]
[]
[]
[]
[]
[]
[]
[]
[]
[]
[]
[]
[]
[]
[]
[]
[]
[]
[]
[]
[]
[]
[]
[]
[]
[]
[]
[]
[]
[]
[]
[]
[]
[]
[]
[]
[]
[]
[]
[]
[]
[]
[]
[]
[]
[]
[]
[]
[]
[]
[]
[]
[]
[]
[]
[]
[]
[]
[]
[]
[]
[]
[]
[]
[]
[]
[]
[]
[]
[]
[]
[]
[]
[]
[]
[]
[]
[]
[]
[]
[]
[]
[]
[]
[]
[]
[]
[]
[]
[]
[]
[]
[]
[]
[]
[]
[]
[]
[]
[]
[]
[]
[]
[]
[]
[]
[]
[]
[]
[]
[]
[]
[]
[]
[]
[]
[]
[]
[]
[]
[]
[]
[]
[]
[]
[]
[]
[]
[]
[]
[]
[]
[]
[]
[]
[]
[]
[]
[]
[]
[]
[]
[]
[]
[]
[]
[]
[]
[]
[]
[]
[]
[]
[]
[]
[]
[]
[]
[]
[]
[]
[]
[]
[]
[]
[]
[]
[]
[]
[]
[]
[]
[]
[]
[]
[]
[]
[]
[]
[]
[]
[]
[]
[]
[]
[]
[]
[]
[]
[]
[]
[]
[]
[]
[]
[]
[]
[]
[]
[]
[]
[]
[]
[]
[]
[]
[]
[]
[]
[]
[]
[]
[]
[]
[]
[]
[]
[]
[]
[]
[]
[]
[]
[]
[]
[]
[]
[]
[]
[]
[]
[]
[]
[]
[]
[]
[]
[]
[]
[]
[]
[]
[]
[]
[]
[]
[]
[]
[]
[]
[]
[]
[]
[]
[]
[]
[]
[]
[]
[]
[]
[]
[]
[]
[]
[]
[]
[]
[]
[]
[]
[]
[]
[]
[]
[]
[]
[]
[]
[]
[]
[]
[]
[]
[]
[]
[]
[]
[]
[]
[]
[]
[]
[]
[]
[]
[]
[]
[]
[]
[]
[]
[]
[]
[]
[]
[]
[]
[]
[]
[]
[]
[]
[]
[]
[]
[]
[]
[]
[]
[]
[]
[]
[]
[]
[]
[]
[]
[]
[]
[]
[]
[]
[]
[]
[]
[]
[]
[]
[]
[]
[]
[]
[]
[]
[]
[]
[]
[]
[]
[]
[]
[]
[]
[]
[]
[]
[]
[]
[]
[]
[]
[]
[]
[]
[]
[]
[]
[]
[]
[]
[]
[]
[]
[]
[]
[]
[]
[]
[]
[]
[]
[]
[]
[]
[]
[]
[]
[]
[]
[]
[]
[]
[]
[]
[]
[]
[]
[]
[]
[]
[]
[]
[]
[]
[]
[]
[]
[]
[]
[]
[]
[]
[]
[]
[]
[]
[]
[]
[]
[]
[]
[]
[]
[]
[]
[]
[]
[]
[]
[]
[]
[]
[]
[]
[]
[]
[]
[]
[]
[]
[]
[]
[]
[]
[]
[]
[]
[]
[]
[]
[]
[]
[]
[]
[]
[]
[]
[]
[]
[]
[]
[]
[]
[]
[]
[]
[]
[]
[]
[]
[]
[]
[]
[]
[]
[]
[]
[]
[]
[]
[]
[]
[]
[]
[]
[]
[]
[]
[]
[]
[]
[]
[]
[]
[]
[]
[]
[]
[]
[]
[]
[]
[]
[]
[]
[]
[]
[]
[]
[]
[]
[]
[]
[]
[]
[]
[]
[]
[]
[]
[]
[]
[]
[]
[]
[]
[]
[]
[]
[]
[]
[]
[]
[]
[]
[]
[]
[]
[]
[]
[]
[]
[]
[]
[]
[]
[]
[]
[]
[]
[]
[]
[]
[]
[]
[]
[]
[]
[]
[]
[]
[]
[]
[]
[]
[]
[]
[]
[]
[]
[]
[]
[]
[]
[]
[]
[]
[]
[]
[]
[]
[]
[]
[]
[]
[]
[]
[]
[]
[]
[]
[]
[]
[]
[]
[]
[]
[]
[]
[]
[]
[]
[]
[]
[]
[]
[]
[]
[]
[]
[]
[]
[]
[]
[]
[]
[]
[]
[]
[]
[]
[]
[]
[]
[]
[]
[]
[]
[]
[]
[]
[]
[]
[]
[]
[]
[]
[]
[]
[]
[]
[]
[]
[]
[]
[]
[]
[]
[]
[]
[]
[]
[]
[]
[]
[]
[]
[]
[]
[]
[]
[]
[]
[]
[]
[]
[]
[]
[]
[]
[]
[]
[]
[]
[]
[]
[]
[]
[]
[]
[]
[]
[]
[]
[]
[]
[]
[]
[]
[]
[]
[]
[]
[]
[]
[]
[]
[]
[]
[]
[]
[]
[]
[]
[]
[]
[]
[]
[]
[]
[]
[]
[]
[]
[]
[]
[]
[]
[]
[]
[]
[]
[]
[]
[]
[]
[]
[]
[]
[]
[]
[]
[]
[]
[]
[]
[]
[]
[]
[]
[]
[]
[]
[]
[]
[]
[]
[]
[]
[]
[]
[]
[]
[]
[]
[]
[]
[]
[]
[]
[]
[]
[]
[]
[]
[]
[]
[]
[]
[]
[]
[]
[]
[]
[]
[]
[]
[]
[]
[]
[]
[]
[]
[]
[]
[]
[]
[]
[]
[]
[]
[]
[]
[]
[]
[]
[]
[]
[]
[]
[]
[]
[]
[]
[]
[]
[]
[]
[]
[]
[]
[]
[]
[]
[]
[]
[]
[]
[]
[]
[]
[]
[]
[]
[]
[]
[]
[]
[]
[]
[]
[]
[]
[]
[]
[]
[]
[]
[]
[]
[]
[]
[]
[]
[]
[]
[]
[]
[]
[]
[]
[]
[]
[]
[]
[]
[]
[]
[]
[]
[]
[]
[]
[]
[]
[]
[]
[]
[]
[]
[]
[]
[]
[]
[]
[]
[]
[]
[]
[]
[]
[]
[]
[]
[]
[]
[]
[]
[]
[]
[]
[]
[]
[]
[]
[]
[]
[]
[]
[]
[]
[]
[]
[]
[]
[]
[]
[]
[]
[]
[]
[]
[]
[]
[]
[]
[]
[]
[]
[]
[]
[]
[]
[]
[]
[]
[]
[]
[]
[]
[]
[]
[]
[]
[]
[]
[]
[]
[]
[]
[]
[]
[]
[]
[]
[]
[]
[]
[]
[]
[]
[]
[]
[]
[]
[]
[]
[]
[]
[]
[]
[]
[]
[]
[]
[]
[]
[]
[]
[]
[]
[]
[]
[]
[]
[]
[]
[]
[]
[]
[]
[]
[]
[]
[]
[]
[]
[]
[]
[]
[]
[]
[]
[]
[]
[]
[]
[]
[]
[]
[]
[]
[]
[]
[]
[]
[]
[]
[]
[]
[]
[]
[]
[]
[]
[]
[]
[]
[]
[]
[]
[]
[]
[]
[]
[]
[]
[]
[]
[]
[]
[]
[]
[]
[]
[]
[]
[]
[]
[]
[]
[]
[]
[]
[]
[]
[]
[]
[]
[]
[]
[]
[]
[]
[]
[]
[]
[]
[]
[]
[]
[]
[]
[]
[]
[]
[]
[]
[]
[]
[]
[]
[]
[]
[]
[]
[]
[]
[]
[]
[]
[]
[]
[]
[]
[]
[]
[]
[]
[]
[]
[]
[]
[]
[]
[]
[]
[]
[]
[]
[]
[]
[]
[]
[]
[]
[]
[]
[]
[]
[]
[]
[]
[]
[]
[]
[]
[]
[]
[]
[]
[]
[]
[]
[]
[]
[]
[]
[]
[]
[]
[]
[]
[]
[]
[]
[]
[]
[]
[]
[]
[]
[]
[]
[]
[]
[]
[]
[]
[]
[]
[]
[]
[]
[]
[]
[]
[]
[]
[]
[]
[]
[]
[]
[]
[]
[]
[]
[]
[]
[]
[]
[]
[]
[]
[]
[]
[]
[]
[]
[]
[]
[]
[]
[]
[]
[]
[]
[]
[]
[]
[]
[]
[]
[]
[]
[]
[]
[]
[]
[]
[]
[]
[]
[]
[]
[]
[]
[]
[]
[]
[]
[]
[]
[]
[]
[]
[]
[]
[]
[]
[]
[]
[]
[]
[]
[]
[]
[]
[]
[]
[]
[]
[]
[]
[]
[]
[]
[]
[]
[]
[]
[]
[]
[]
[]
[]
[]
[]
[]
[]
[]
[]
[]
[]
[]
[]
[]
[]
[]
[]
[]
[]
[]
[]
[]
[]
[]
[]
[]
[]
[]
[]
[]
[]
[]
[]
[]
[]
[]
[]
[]
[]
[]
[]
[]
[]
[]
[]
[]
[]
[]
[]
[]
[]
[]
[]
[]
[]
[]
[]
[]
[]
[]
[]
[]
[]
[]
[]
[]
[]
[]
[]
[]
[]
[]
[]
[]
[]
[]
[]
[]
[]
[]
[]
[]
[]
[]
[]
[]
[]
[]
[]
[]
[]
[]
[]
[]
[]
[]
[]
[]
[]
[null,null,null,null,null,null,null,null,null,null,null,null,null,false]

{"sheet":"이름지정","index":5,"n_rows":637,"n_cols":5,"rows_kept":637,"cut":false,"hidden":true,"merged":[]}
["년도","월","연도","날짜","휴일명"]
[2010,1,{"$f":"YEAR(D2)","v":2010},"2010-02-13","설날"]
[2011,2,{"$f":"YEAR(D3)","v":2010},"2010-02-14","설날"]
[2012,3,2010,"2010-02-15","설날"]
[2013,4,2010,"2010-05-21","석가탄신일"]
[2014,5,2010,"2010-09-21","추석"]
[2015,6,2010,"2010-09-22","추석"]
[2016,7,2010,"2010-09-23","추석"]
[2017,8,2011,"2011-02-02","설날"]
[2018,9,2011,"2011-02-03","설날"]
[2019,10,2011,"2011-02-04","설날"]
[2020,11,2011,"2011-05-10","석가탄신일"]
[2021,12,2011,"2011-09-11","추석"]
[2022,null,2011,"2011-09-12","추석"]
[2023,null,2011,"2011-09-13","추석"]
[2024,null,2012,"2012-01-22","설날"]
[2025,null,2012,"2012-01-23","설날"]
[2026,null,2012,"2012-01-24","설날"]
[2027,null,2012,"2012-05-28","석가탄신일"]
[2028,null,2012,"2012-09-29","추석"]
[2029,null,2012,"2012-09-30","추석"]
[2030,null,2012,"2012-10-01","추석"]
[2031,null,2013,"2013-02-09","설날"]
[2032,null,2013,"2013-02-10","설날"]
[2033,null,2013,"2013-02-11","설날"]
[2034,null,2013,"2013-05-17","석가탄신일"]
[2035,null,2013,"2013-09-18","추석"]
[2036,null,2013,"2013-09-19","추석"]
[2037,null,2013,"2013-09-20","추석"]
[2038,null,2014,"2014-01-30","설날"]
[2039,null,2014,"2014-01-31","설날"]
[2040,null,2014,"2014-02-01","설날"]
[2041,null,2014,"2014-05-06","석가탄신일"]
[2042,null,2014,"2014-09-07","추석"]
[2043,null,2014,"2014-09-08","추석"]
[2044,null,2014,"2014-09-09","추석"]
[2045,null,2015,"2015-02-18","설날"]
[2046,null,2015,"2015-02-19","설날"]
[2047,null,2015,"2015-02-20","설날"]
[2048,null,2015,"2015-05-25","석가탄신일"]
[2049,null,2015,"2015-09-26","추석"]
[2050,null,2015,"2015-09-27","추석"]
[2051,null,2015,"2015-09-28","추석"]
[2052,null,2016,"2016-02-08","설날"]
[2053,null,2016,"2016-02-09","설날"]
[2054,null,2016,"2016-02-10","설날"]
[2055,null,2016,"2016-05-14","석가탄신일"]
[2056,null,2016,"2016-09-14","추석"]
[2057,null,2016,"2016-09-15","추석"]
[2058,null,2016,"2016-09-16","추석"]
[2059,null,2017,"2017-01-27","설날"]
[2060,null,2017,"2017-01-28","설날"]
[2061,null,2017,"2017-01-29","설날"]
[2062,null,2017,"2017-05-03","석가탄신일"]
[2063,null,2017,"2017-10-03","추석"]
[2064,null,2017,"2017-10-04","추석"]
[2065,null,2017,"2017-10-05","추석"]
[2066,null,2018,"2018-02-15","설날"]
[2067,null,2018,"2018-02-16","설날"]
[2068,null,2018,"2018-02-17","설날"]
[2069,null,2018,"2018-05-22","석가탄신일"]
[2070,null,2018,"2018-09-23","추석"]
[2071,null,2018,"2018-09-24","추석"]
[2072,null,2018,"2018-09-25","추석"]
[2073,null,2019,"2019-02-04","설날"]
[2074,null,2019,"2019-02-05","설날"]
[2075,null,{"$f":"YEAR(D67)","v":2019},"2019-02-06","설날"]
[2076,null,2019,"2019-05-12","석가탄신일"]
[2077,null,2019,"2019-09-12","추석"]
[2078,null,2019,"2019-09-13","추석"]
[2079,null,2019,"2019-09-14","추석"]
[2080,null,2020,"2020-01-24","설날"]
[2081,null,2020,"2020-01-25","설날"]
[2082,null,2020,"2020-01-26","설날"]
[2083,null,2020,"2020-04-30","석가탄신일"]
[2084,null,2020,"2020-09-30","추석"]
[2085,null,2020,"2020-10-01","추석"]
[2086,null,2020,"2020-10-02","추석"]
[2087,null,2021,"2021-02-11","설날"]
[2088,null,2021,"2021-02-12","설날"]
[2089,null,2021,"2021-02-13","설날"]
[2090,null,2021,"2021-05-19","석가탄신일"]
[2091,null,2021,"2021-09-20","추석"]
[2092,null,2021,"2021-09-21","추석"]
[2093,null,2021,"2021-09-22","추석"]
[2094,null,2022,"2022-01-31","설날"]
[2095,null,2022,"2022-02-01","설날"]
[2096,null,2022,"2022-02-02","설날"]
[2097,null,2022,"2022-05-08","석가탄신일"]
[2098,null,2022,"2022-09-09","추석"]
[2099,null,2022,"2022-09-10","추석"]
[2100,null,2022,"2022-09-11","추석"]
[null,null,2023,"2023-01-21","설날"]
[null,null,2023,"2023-01-22","설날"]
[null,null,2023,"2023-01-23","설날"]
[null,null,2023,"2023-05-27","석가탄신일"]
[null,null,2023,"2023-09-28","추석"]
[null,null,2023,"2023-09-29","추석"]
[null,null,2023,"2023-09-30","추석"]
[null,null,2024,"2024-02-09","설날"]
[null,null,2024,"2024-02-10","설날"]
[null,null,2024,"2024-02-11","설날"]
[null,null,2024,"2024-05-15","석가탄신일"]
[null,null,2024,"2024-09-16","추석"]
[null,null,2024,"2024-09-17","추석"]
[null,null,2024,"2024-09-18","추석"]
[null,null,2025,"2025-01-28","설날"]
[null,null,2025,"2025-01-29","설날"]
[null,null,2025,"2025-01-30","설날"]
[null,null,2025,"2025-05-05","석가탄신일"]
[null,null,2025,"2025-10-05","추석"]
[null,null,2025,"2025-10-06","추석"]
[null,null,2025,"2025-10-07","추석"]
[null,null,2026,"2026-02-16","설날"]
[null,null,2026,"2026-02-17","설날"]
[null,null,2026,"2026-02-18","설날"]
[null,null,2026,"2026-05-24","석가탄신일"]
[null,null,2026,"2026-09-24","추석"]
[null,null,2026,"2026-09-25","추석"]
[null,null,2026,"2026-09-26","추석"]
[null,null,2027,"2027-02-06","설날"]
[null,null,2027,"2027-02-07","설날"]
[null,null,2027,"2027-02-08","설날"]
[null,null,2027,"2027-05-13","석가탄신일"]
[null,null,2027,"2027-09-14","추석"]
[null,null,2027,"2027-09-15","추석"]
[null,null,2027,"2027-09-16","추석"]
[null,null,2028,"2028-01-26","설날"]
[null,null,2028,"2028-01-27","설날"]
[null,null,2028,"2028-01-28","설날"]
[null,null,{"$f":"YEAR(D131)","v":2028},"2028-05-02","석가탄신일"]
[null,null,2028,"2028-10-02","추석"]
[null,null,2028,"2028-10-03","추석"]
[null,null,2028,"2028-10-04","추석"]
[null,null,2029,"2029-02-12","설날"]
[null,null,2029,"2029-02-13","설날"]
[null,null,2029,"2029-02-14","설날"]
[null,null,2029,"2029-05-20","석가탄신일"]
[null,null,2029,"2029-09-21","추석"]
[null,null,2029,"2029-09-22","추석"]
[null,null,2029,"2029-09-23","추석"]
[null,null,2030,"2030-02-02","설날"]
[null,null,2030,"2030-02-03","설날"]
[null,null,2030,"2030-02-04","설날"]
[null,null,2030,"2030-05-09","석가탄신일"]
[null,null,2030,"2030-09-11","추석"]
[null,null,2030,"2030-09-12","추석"]
[null,null,2030,"2030-09-13","추석"]
[null,null,2031,"2031-01-22","설날"]
[null,null,2031,"2031-01-23","설날"]
[null,null,2031,"2031-01-24","설날"]
[null,null,2031,"2031-05-28","석가탄신일"]
[null,null,2031,"2031-09-30","추석"]
[null,null,2031,"2031-10-01","추석"]
[null,null,2031,"2031-10-02","추석"]
[null,null,2032,"2032-02-10","설날"]
[null,null,2032,"2032-02-11","설날"]
[null,null,2032,"2032-02-12","설날"]
[null,null,2032,"2032-05-16","석가탄신일"]
[null,null,2032,"2032-09-18","추석"]
[null,null,2032,"2032-09-19","추석"]
[null,null,2032,"2032-09-20","추석"]
[null,null,2033,"2033-01-30","설날"]
[null,null,2033,"2033-01-31","설날"]
[null,null,2033,"2033-02-01","설날"]
[null,null,2033,"2033-05-06","석가탄신일"]
[null,null,2033,"2033-10-06","추석"]
[null,null,2033,"2033-10-07","추석"]
[null,null,2033,"2033-10-08","추석"]
[null,null,2034,"2034-02-18","설날"]
[null,null,2034,"2034-02-19","설날"]
[null,null,2034,"2034-02-20","설날"]
[null,null,2034,"2034-05-25","석가탄신일"]
[null,null,2034,"2034-09-26","추석"]
[null,null,2034,"2034-09-27","추석"]
[null,null,2034,"2034-09-28","추석"]
[null,null,2035,"2035-02-07","설날"]
[null,null,2035,"2035-02-08","설날"]
[null,null,2035,"2035-02-09","설날"]
[null,null,2035,"2035-05-15","석가탄신일"]
[null,null,2035,"2035-09-15","추석"]
[null,null,2035,"2035-09-16","추석"]
[null,null,2035,"2035-09-17","추석"]
[null,null,2036,"2036-01-27","설날"]
[null,null,2036,"2036-01-28","설날"]
[null,null,2036,"2036-01-29","설날"]
[null,null,2036,"2036-05-03","석가탄신일"]
[null,null,2036,"2036-10-03","추석"]
[null,null,2036,"2036-10-04","추석"]
[null,null,2036,"2036-10-05","추석"]
[null,null,2037,"2037-02-14","설날"]
[null,null,2037,"2037-02-15","설날"]
[null,null,2037,"2037-02-16","설날"]
[null,null,2037,"2037-05-22","석가탄신일"]
[null,null,{"$f":"YEAR(D195)","v":2037},"2037-09-23","추석"]
[null,null,2037,"2037-09-24","추석"]
[null,null,2037,"2037-09-25","추석"]
[null,null,2038,"2038-02-03","설날"]
[null,null,2038,"2038-02-04","설날"]
[null,null,2038,"2038-02-05","설날"]
[null,null,2038,"2038-05-11","석가탄신일"]
[null,null,2038,"2038-09-12","추석"]
[null,null,2038,"2038-09-13","추석"]
[null,null,2038,"2038-09-14","추석"]
[null,null,2039,"2039-01-23","설날"]
[null,null,2039,"2039-01-24","설날"]
[null,null,2039,"2039-01-25","설날"]
[null,null,2039,"2039-04-30","석가탄신일"]
[null,null,2039,"2039-10-01","추석"]
[null,null,2039,"2039-10-02","추석"]
[null,null,2039,"2039-10-03","추석"]
[null,null,2040,"2040-02-11","설날"]
[null,null,2040,"2040-02-12","설날"]
[null,null,2040,"2040-02-13","설날"]
[null,null,2040,"2040-05-18","석가탄신일"]
[null,null,2040,"2040-09-20","추석"]
[null,null,2040,"2040-09-21","추석"]
[null,null,2040,"2040-09-22","추석"]
[null,null,2041,"2041-01-31","설날"]
[null,null,2041,"2041-02-01","설날"]
[null,null,2041,"2041-02-02","설날"]
[null,null,2041,"2041-05-07","석가탄신일"]
[null,null,2041,"2041-09-09","추석"]
[null,null,2041,"2041-09-10","추석"]
[null,null,2041,"2041-09-11","추석"]
[null,null,2042,"2042-01-21","설날"]
[null,null,2042,"2042-01-22","설날"]
[null,null,2042,"2042-01-23","설날"]
[null,null,2042,"2042-05-26","석가탄신일"]
[null,null,2042,"2042-09-27","추석"]
[null,null,2042,"2042-09-28","추석"]
[null,null,2042,"2042-09-29","추석"]
[null,null,2043,"2043-02-09","설날"]
[null,null,2043,"2043-02-10","설날"]
[null,null,2043,"2043-02-11","설날"]
[null,null,2043,"2043-05-16","석가탄신일"]
[null,null,2043,"2043-09-16","추석"]
[null,null,2043,"2043-09-17","추석"]
[null,null,2043,"2043-09-18","추석"]
[null,null,2044,"2044-01-29","설날"]
[null,null,2044,"2044-01-30","설날"]
[null,null,2044,"2044-01-31","설날"]
[null,null,2044,"2044-05-05","석가탄신일"]
[null,null,2044,"2044-10-04","추석"]
[null,null,2044,"2044-10-05","추석"]
[null,null,2044,"2044-10-06","추석"]
[null,null,2045,"2045-02-16","설날"]
[null,null,2045,"2045-02-17","설날"]
[null,null,2045,"2045-02-18","설날"]
[null,null,2045,"2045-05-24","석가탄신일"]
[null,null,2045,"2045-09-24","추석"]
[null,null,2045,"2045-09-25","추석"]
[null,null,2045,"2045-09-26","추석"]
[null,null,2046,"2046-02-05","설날"]
[null,null,2046,"2046-02-06","설날"]
[null,null,2046,"2046-02-07","설날"]
[null,null,2046,"2046-05-13","석가탄신일"]
[null,null,2046,"2046-09-14","추석"]
[null,null,{"$f":"YEAR(D259)","v":2046},"2046-09-15","추석"]
[null,null,2046,"2046-09-16","추석"]
[null,null,2047,"2047-01-25","설날"]
[null,null,2047,"2047-01-26","설날"]
[null,null,2047,"2047-01-27","설날"]
[null,null,2047,"2047-05-02","석가탄신일"]
[null,null,2047,"2047-10-04","추석"]
[null,null,2047,"2047-10-05","추석"]
[null,null,2048,"2048-02-13","설날"]
[null,null,2048,"2048-02-14","설날"]
[null,null,2048,"2048-02-15","설날"]
[null,null,2048,"2048-05-20","석가탄신일"]
[null,null,2048,"2048-09-21","추석"]
[null,null,2048,"2048-09-22","추석"]
[null,null,2048,"2048-09-23","추석"]
[null,null,2049,"2049-02-01","설날"]
[null,null,2049,"2049-02-02","설날"]
[null,null,2049,"2049-02-03","설날"]
[null,null,2049,"2049-05-09","석가탄신일"]
[null,null,2049,"2049-09-10","추석"]
[null,null,2049,"2049-09-11","추석"]
[null,null,2049,"2049-09-12","추석"]
[null,null,2050,"2050-01-22","설날"]
[null,null,2050,"2050-01-23","설날"]
[null,null,2050,"2050-01-24","설날"]
[null,null,2050,"2050-05-28","석가탄신일"]
[null,null,2050,"2050-09-29","추석"]
[null,null,2050,"2050-09-30","추석"]
[null,null,2050,"2050-10-01","추석"]
[null,null,2051,"2051-02-10","설날"]
[null,null,2051,"2051-02-11","설날"]
[null,null,2051,"2051-02-12","설날"]
[null,null,2051,"2051-05-17","석가탄신일"]
[null,null,2051,"2051-09-18","추석"]
[null,null,2051,"2051-09-19","추석"]
[null,null,2051,"2051-09-20","추석"]
[null,null,2052,"2052-01-31","설날"]
[null,null,2052,"2052-02-01","설날"]
[null,null,2052,"2052-02-02","설날"]
[null,null,2052,"2052-05-06","석가탄신일"]
[null,null,2052,"2052-09-06","추석"]
[null,null,2052,"2052-09-07","추석"]
[null,null,2052,"2052-09-08","추석"]
[null,null,2053,"2053-02-18","설날"]
[null,null,2053,"2053-02-19","설날"]
[null,null,2053,"2053-02-20","설날"]
[null,null,2053,"2053-05-25","석가탄신일"]
[null,null,2053,"2053-09-25","추석"]
[null,null,2053,"2053-09-26","추석"]
[null,null,2053,"2053-09-27","추석"]
[null,null,2054,"2054-02-07","설날"]
[null,null,2054,"2054-02-08","설날"]
[null,null,2054,"2054-02-09","설날"]
[null,null,2054,"2054-05-15","석가탄신일"]
[null,null,2054,"2054-09-15","추석"]
[null,null,2054,"2054-09-16","추석"]
[null,null,2054,"2054-09-17","추석"]
[null,null,2055,"2055-01-27","설날"]
[null,null,2055,"2055-01-28","설날"]
[null,null,2055,"2055-01-29","설날"]
[null,null,2055,"2055-05-04","석가탄신일"]
[null,null,2055,"2055-10-04","추석"]
[null,null,2055,"2055-10-05","추석"]
[null,null,2055,"2055-10-06","추석"]
[null,null,{"$f":"YEAR(D323)","v":2056},"2056-02-14","설날"]
[null,null,2056,"2056-02-15","설날"]
[null,null,2056,"2056-02-16","설날"]
[null,null,2056,"2056-05-22","석가탄신일"]
[null,null,2056,"2056-09-23","추석"]
[null,null,2056,"2056-09-24","추석"]
[null,null,2056,"2056-09-25","추석"]
[null,null,2057,"2057-02-03","설날"]
[null,null,2057,"2057-02-04","설날"]
[null,null,2057,"2057-02-05","설날"]
[null,null,2057,"2057-05-11","석가탄신일"]
[null,null,2057,"2057-09-12","추석"]
[null,null,2057,"2057-09-13","추석"]
[null,null,2057,"2057-09-14","추석"]
[null,null,2058,"2058-01-23","설날"]
[null,null,2058,"2058-01-24","설날"]
[null,null,2058,"2058-01-25","설날"]
[null,null,2058,"2058-04-30","석가탄신일"]
[null,null,2058,"2058-10-01","추석"]
[null,null,2058,"2058-10-02","추석"]
[null,null,2058,"2058-10-03","추석"]
[null,null,2059,"2059-02-11","설날"]
[null,null,2059,"2059-02-12","설날"]
[null,null,2059,"2059-02-13","설날"]
[null,null,2059,"2059-05-19","석가탄신일"]
[null,null,2059,"2059-09-20","추석"]
[null,null,2059,"2059-09-21","추석"]
[null,null,2059,"2059-09-22","추석"]
[null,null,2060,"2060-02-01","설날"]
[null,null,2060,"2060-02-02","설날"]
[null,null,2060,"2060-02-03","설날"]
[null,null,2060,"2060-05-07","석가탄신일"]
[null,null,2060,"2060-09-08","추석"]
[null,null,2060,"2060-09-09","추석"]
[null,null,2060,"2060-09-10","추석"]
[null,null,2061,"2061-01-21","설날"]
[null,null,2061,"2061-01-22","설날"]
[null,null,2061,"2061-01-23","설날"]
[null,null,2061,"2061-05-26","석가탄신일"]
[null,null,2061,"2061-09-27","추석"]
[null,null,2061,"2061-09-28","추석"]
[null,null,2061,"2061-09-29","추석"]
[null,null,2062,"2062-02-08","설날"]
[null,null,2062,"2062-02-09","설날"]
[null,null,2062,"2062-02-10","설날"]
[null,null,2062,"2062-05-16","석가탄신일"]
[null,null,2062,"2062-09-16","추석"]
[null,null,2062,"2062-09-17","추석"]
[null,null,2062,"2062-09-18","추석"]
[null,null,2063,"2063-01-28","설날"]
[null,null,2063,"2063-01-29","설날"]
[null,null,2063,"2063-01-30","설날"]
[null,null,2063,"2063-05-06","석가탄신일"]
[null,null,2063,"2063-10-05","추석"]
[null,null,2063,"2063-10-06","추석"]
[null,null,2063,"2063-10-07","추석"]
[null,null,2064,"2064-02-16","설날"]
[null,null,2064,"2064-02-17","설날"]
[null,null,2064,"2064-02-18","설날"]
[null,null,2064,"2064-05-23","석가탄신일"]
[null,null,2064,"2064-09-24","추석"]
[null,null,2064,"2064-09-25","추석"]
[null,null,2064,"2064-09-26","추석"]
[null,null,2065,"2065-02-04","설날"]
[null,null,{"$f":"YEAR(D387)","v":2065},"2065-02-05","설날"]
[null,null,2065,"2065-02-06","설날"]
[null,null,2065,"2065-05-12","석가탄신일"]
[null,null,2065,"2065-09-14","추석"]
[null,null,2065,"2065-09-15","추석"]
[null,null,2065,"2065-09-16","추석"]
[null,null,2066,"2066-01-25","설날"]
[null,null,2066,"2066-01-26","설날"]
[null,null,2066,"2066-01-27","설날"]
[null,null,2066,"2066-05-01","석가탄신일"]
[null,null,2066,"2066-10-02","추석"]
[null,null,2066,"2066-10-03","추석"]
[null,null,2066,"2066-10-04","추석"]
[null,null,2067,"2067-02-13","설날"]
[null,null,2067,"2067-02-14","설날"]
[null,null,2067,"2067-02-15","설날"]
[null,null,2067,"2067-05-20","석가탄신일"]
[null,null,2067,"2067-09-22","추석"]
[null,null,2067,"2067-09-23","추석"]
[null,null,2067,"2067-09-24","추석"]
[null,null,2068,"2068-02-02","설날"]
[null,null,2068,"2068-02-03","설날"]
[null,null,2068,"2068-02-04","설날"]
[null,null,2068,"2068-05-09","석가탄신일"]
[null,null,2068,"2068-09-10","추석"]
[null,null,2068,"2068-09-11","추석"]
[null,null,2068,"2068-09-12","추석"]
[null,null,2069,"2069-01-22","설날"]
[null,null,2069,"2069-01-23","설날"]
[null,null,2069,"2069-01-24","설날"]
[null,null,2069,"2069-04-28","석가탄신일"]
[null,null,2069,"2069-09-28","추석"]
[null,null,2069,"2069-09-29","추석"]
[null,null,2069,"2069-09-30","추석"]
[null,null,2070,"2070-02-10","설날"]
[null,null,2070,"2070-02-11","설날"]
[null,null,2070,"2070-02-12","설날"]
[null,null,2070,"2070-05-17","석가탄신일"]
[null,null,2070,"2070-09-18","추석"]
[null,null,2070,"2070-09-19","추석"]
[null,null,2070,"2070-09-20","추석"]
[null,null,2071,"2071-01-30","설날"]
[null,null,2071,"2071-01-31","설날"]
[null,null,2071,"2071-02-01","설날"]
[null,null,2071,"2071-05-07","석가탄신일"]
[null,null,2071,"2071-09-07","추석"]
[null,null,2071,"2071-09-08","추석"]
[null,null,2071,"2071-09-09","추석"]
[null,null,2072,"2072-02-18","설날"]
[null,null,2072,"2072-02-19","설날"]
[null,null,2072,"2072-02-20","설날"]
[null,null,2072,"2072-05-25","석가탄신일"]
[null,null,2072,"2072-09-25","추석"]
[null,null,2072,"2072-09-26","추석"]
[null,null,2072,"2072-09-27","추석"]
[null,null,2073,"2073-02-06","설날"]
[null,null,2073,"2073-02-07","설날"]
[null,null,2073,"2073-02-08","설날"]
[null,null,2073,"2073-05-14","석가탄신일"]
[null,null,2073,"2073-09-15","추석"]
[null,null,2073,"2073-09-16","추석"]
[null,null,2073,"2073-09-17","추석"]
[null,null,2074,"2074-01-26","설날"]
[null,null,2074,"2074-01-27","설날"]
[null,null,{"$f":"YEAR(D451)","v":2074},"2074-01-28","설날"]
[null,null,2074,"2074-05-03","석가탄신일"]
[null,null,2074,"2074-10-04","추석"]
[null,null,2074,"2074-10-05","추석"]
[null,null,2074,"2074-10-06","추석"]
[null,null,2075,"2075-02-14","설날"]
[null,null,2075,"2075-02-15","설날"]
[null,null,2075,"2075-02-16","설날"]
[null,null,2075,"2075-05-22","석가탄신일"]
[null,null,2075,"2075-09-23","추석"]
[null,null,2075,"2075-09-24","추석"]
[null,null,2075,"2075-09-25","추석"]
[null,null,2076,"2076-02-04","설날"]
[null,null,2076,"2076-02-05","설날"]
[null,null,2076,"2076-02-06","설날"]
[null,null,2076,"2076-05-10","석가탄신일"]
[null,null,2076,"2076-09-11","추석"]
[null,null,2076,"2076-09-12","추석"]
[null,null,2076,"2076-09-13","추석"]
[null,null,2077,"2077-01-23","설날"]
[null,null,2077,"2077-01-24","설날"]
[null,null,2077,"2077-01-25","설날"]
[null,null,2077,"2077-04-30","석가탄신일"]
[null,null,2077,"2077-09-30","추석"]
[null,null,2077,"2077-10-01","추석"]
[null,null,2077,"2077-10-02","추석"]
[null,null,2078,"2078-02-11","설날"]
[null,null,2078,"2078-02-12","설날"]
[null,null,2078,"2078-02-13","설날"]
[null,null,2078,"2078-05-19","석가탄신일"]
[null,null,2078,"2078-09-19","추석"]
[null,null,2078,"2078-09-20","추석"]
[null,null,2078,"2078-09-21","추석"]
[null,null,2079,"2079-02-01","설날"]
[null,null,2079,"2079-02-02","설날"]
[null,null,2079,"2079-02-03","설날"]
[null,null,2079,"2079-05-08","석가탄신일"]
[null,null,2079,"2079-09-09","추석"]
[null,null,2079,"2079-09-10","추석"]
[null,null,2079,"2079-09-11","추석"]
[null,null,2080,"2080-01-21","설날"]
[null,null,2080,"2080-01-22","설날"]
[null,null,2080,"2080-01-23","설날"]
[null,null,2080,"2080-05-26","석가탄신일"]
[null,null,2080,"2080-09-27","추석"]
[null,null,2080,"2080-09-28","추석"]
[null,null,2080,"2080-09-29","추석"]
[null,null,2081,"2081-02-08","설날"]
[null,null,2081,"2081-02-09","설날"]
[null,null,2081,"2081-02-10","설날"]
[null,null,2081,"2081-05-16","석가탄신일"]
[null,null,2081,"2081-09-16","추석"]
[null,null,2081,"2081-09-17","추석"]
[null,null,2081,"2081-09-18","추석"]
[null,null,2082,"2082-01-28","설날"]
[null,null,2082,"2082-01-29","설날"]
[null,null,2082,"2082-01-30","설날"]
[null,null,2082,"2082-05-05","석가탄신일"]
[null,null,2082,"2082-10-05","추석"]
[null,null,2082,"2082-10-06","추석"]
[null,null,2082,"2082-10-07","추석"]
[null,null,2083,"2083-02-16","설날"]
[null,null,2083,"2083-02-17","설날"]
[null,null,2083,"2083-02-18","설날"]
[null,null,{"$f":"YEAR(D515)","v":2083},"2083-05-24","석가탄신일"]
[null,null,2083,"2083-09-25","추석"]
[null,null,2083,"2083-09-26","추석"]
[null,null,2083,"2083-09-27","추석"]
[null,null,2084,"2084-02-05","설날"]
[null,null,2084,"2084-02-06","설날"]
[null,null,2084,"2084-02-07","설날"]
[null,null,2084,"2084-05-12","석가탄신일"]
[null,null,2084,"2084-09-13","추석"]
[null,null,2084,"2084-09-14","추석"]
[null,null,2084,"2084-09-15","추석"]
[null,null,2085,"2085-01-25","설날"]
[null,null,2085,"2085-01-26","설날"]
[null,null,2085,"2085-01-27","설날"]
[null,null,2085,"2085-05-01","석가탄신일"]
[null,null,2085,"2085-10-02","추석"]
[null,null,2085,"2085-10-03","추석"]
[null,null,2085,"2085-10-04","추석"]
[null,null,2086,"2086-02-13","설날"]
[null,null,2086,"2086-02-14","설날"]
[null,null,2086,"2086-02-15","설날"]
[null,null,2086,"2086-05-20","석가탄신일"]
[null,null,2086,"2086-09-21","추석"]
[null,null,2086,"2086-09-22","추석"]
[null,null,2086,"2086-09-23","추석"]
[null,null,2087,"2087-02-02","설날"]
[null,null,2087,"2087-02-03","설날"]
[null,null,2087,"2087-02-04","설날"]
[null,null,2087,"2087-05-10","석가탄신일"]
[null,null,2087,"2087-09-10","추석"]
[null,null,2087,"2087-09-11","추석"]
[null,null,2087,"2087-09-12","추석"]
[null,null,2088,"2088-01-23","설날"]
[null,null,2088,"2088-01-24","설날"]
[null,null,2088,"2088-01-25","설날"]
[null,null,2088,"2088-04-28","석가탄신일"]
[null,null,2088,"2088-09-28","추석"]
[null,null,2088,"2088-09-29","추석"]
[null,null,2088,"2088-09-30","추석"]
[null,null,2089,"2089-02-10","설날"]
[null,null,2089,"2089-02-11","설날"]
[null,null,2089,"2089-02-12","설날"]
[null,null,2089,"2089-05-17","석가탄신일"]
[null,null,2089,"2089-09-18","추석"]
[null,null,2089,"2089-09-19","추석"]
[null,null,2089,"2089-09-20","추석"]
[null,null,2090,"2090-01-29","설날"]
[null,null,2090,"2090-01-30","설날"]
[null,null,2090,"2090-01-31","설날"]
[null,null,2090,"2090-05-07","석가탄신일"]
[null,null,2090,"2090-09-07","추석"]
[null,null,2090,"2090-09-08","추석"]
[null,null,2090,"2090-09-09","추석"]
[null,null,2091,"2091-02-17","설날"]
[null,null,2091,"2091-02-18","설날"]
[null,null,2091,"2091-02-19","설날"]
[null,null,2091,"2091-05-25","석가탄신일"]
[null,null,2091,"2091-09-26","추석"]
[null,null,2091,"2091-09-27","추석"]
[null,null,2091,"2091-09-28","추석"]
[null,null,2092,"2092-02-06","설날"]
[null,null,2092,"2092-02-07","설날"]
[null,null,2092,"2092-02-08","설날"]
[null,null,2092,"2092-05-13","석가탄신일"]
[null,null,{"$f":"YEAR(D579)","v":2092},"2092-09-15","추석"]
[null,null,2092,"2092-09-16","추석"]
[null,null,2092,"2092-09-17","추석"]
[null,null,2093,"2093-01-26","설날"]
[null,null,2093,"2093-01-27","설날"]
[null,null,2093,"2093-01-28","설날"]
[null,null,2093,"2093-05-03","석가탄신일"]
[null,null,2093,"2093-10-04","추석"]
[null,null,2093,"2093-10-05","추석"]
[null,null,2093,"2093-10-06","추석"]
[null,null,2094,"2094-02-14","설날"]
[null,null,2094,"2094-02-15","설날"]
[null,null,2094,"2094-02-16","설날"]
[null,null,2094,"2094-05-21","석가탄신일"]
[null,null,2094,"2094-09-23","추석"]
[null,null,2094,"2094-09-24","추석"]
[null,null,2094,"2094-09-25","추석"]
[null,null,2095,"2095-02-04","설날"]
[null,null,2095,"2095-02-05","설날"]
[null,null,2095,"2095-02-06","설날"]
[null,null,2095,"2095-05-11","석가탄신일"]
[null,null,2095,"2095-09-12","추석"]
[null,null,2095,"2095-09-13","추석"]
[null,null,2095,"2095-09-14","추석"]
[null,null,2096,"2096-01-24","설날"]
[null,null,2096,"2096-01-25","설날"]
[null,null,2096,"2096-01-26","설날"]
[null,null,2096,"2096-04-30","석가탄신일"]
[null,null,2096,"2096-09-30","추석"]
[null,null,2096,"2096-10-01","추석"]
[null,null,2096,"2096-10-02","추석"]
[null,null,2097,"2097-02-11","설날"]
[null,null,2097,"2097-02-12","설날"]
[null,null,2097,"2097-02-13","설날"]
[null,null,2097,"2097-05-19","석가탄신일"]
[null,null,2097,"2097-09-19","추석"]
[null,null,2097,"2097-09-20","추석"]
[null,null,2097,"2097-09-21","추석"]
[null,null,2098,"2098-01-31","설날"]
[null,null,2098,"2098-02-01","설날"]
[null,null,2098,"2098-02-02","설날"]
[null,null,2098,"2098-05-08","석가탄신일"]
[null,null,2098,"2098-09-09","추석"]
[null,null,2098,"2098-09-10","추석"]
[null,null,2098,"2098-09-11","추석"]
[null,null,2099,"2099-01-20","설날"]
[null,null,2099,"2099-01-21","설날"]
[null,null,2099,"2099-01-22","설날"]
[null,null,2099,"2099-05-27","석가탄신일"]
[null,null,2099,"2099-09-28","추석"]
[null,null,2099,"2099-09-29","추석"]
[null,null,2099,"2099-09-30","추석"]
[null,null,2100,"2100-02-08","설날"]
[null,null,2100,"2100-02-09","설날"]
[null,null,2100,"2100-02-10","설날"]
[null,null,2100,"2100-05-16","석가탄신일"]
[null,null,2100,"2100-09-17","추석"]
[null,null,2100,"2100-09-18","추석"]
[null,null,2100,"2100-09-19","추석"]